Quality RTOS & Embedded Software

 Real time embedded FreeRTOS RSS feed 
Quick Start Supported MCUs PDF Books Trace Tools Ecosystem


Loading

Build errors on CCS V8: FreeRTOS RTOSDemo (Cortex M4F MSP432 Launchpad) - 101 of them!

Posted by n3rdx on January 11, 2019

Hi first post here: What did I do wrong?

I downloaded the FreeRTOS latest download (today), and then imported the CCS project into code composer studio V8, and attempted to build it.

I got a warning (but not an error?) :

*This project was created using a version of compiler that is not currently installed - 5.2.1 [MSP432]. Another version of the compiler will be used during build - 18.1.4.LTS. See 'Help > Install New Software' and select 'Code Generation Tools Updates' to check if this compiler is available through a CCS update. Visit CCS App Center to get the latest compiler support. Or download and install the compiler, then register it with CCS through 'Preferences > CCS > Build > Compilers'. *

And also I got a whole list ((qty 100) of errors!

Many like: > > "../FullDemo/RegTest.c", line 304: error #10: "#" not expected here > cmp r1, #7 > ^ >
> "../FullDemo/RegTest.c", line 307: error #10: "#" not expected here > cmp r0, #8 > ^ >
> "../Full_Demo/RegTest.c", line 309: error #10: "#" not expected here > cmp r1, #9 > ^

The original file has '#" in many lines of assembly code. ~~~ cmp r1, #7 bne reg2errorloopf vmov r0, r1, d10 cmp r0, #8 bne reg2errorloopf cmp r1, #9 ~~~ any help would be appreciated.


Build errors on CCS V8: FreeRTOS RTOSDemo (Cortex M4F MSP432 Launchpad) - 101 of them!

Posted by rtel on January 11, 2019

Sounds like just a compiler mismatch - this has happened on a few TI compiler updates, although in this case I think the project is quite old. It should be fine if built with the original compiler used, if you can find it.


Build errors on CCS V8: FreeRTOS RTOSDemo (Cortex M4F MSP432 Launchpad) - 101 of them!

Posted by n3rdx on January 11, 2019

Thank you - and I took some time to try to try different compilers (not much luck) including older compilers.

But at this stage, I am noticing even more difficult to figure out issues. Please observe the attached screenshot ... What type of errors do we have in Line 29?

And also, pray tell, where is PRESERVE8 (Line 31) likely to be defined (and it seems it is not?)

By the way the older 100 error codes still exist, I don't know if they are a direct result of the first two errors as the are from the SAME file, and start from immediately after Line 31 ...

So is there a potential syntax error in the first part of the file (attached) ?

Attachments

snafu.png (195182 bytes)

Build errors on CCS V8: FreeRTOS RTOSDemo (Cortex M4F MSP432 Launchpad) - 101 of them!

Posted by n3rdx on January 11, 2019

the attached file is the source of RegTest.c which should be very similar to other FreeRTOS sample files - but can anyone identify if the syntax has been corrupted prior to Line 31?

Attachments

RegTest.c (9935 bytes)

Build errors on CCS V8: FreeRTOS RTOSDemo (Cortex M4F MSP432 Launchpad) - 101 of them!

Posted by n3rdx on January 11, 2019

currently I am compiling with the CCS V8 compiler v18.12.0LTS ... producing all the results starting with "Compilation Failure" below.

~~~ **** Clean-only build of configuration Debug for project RTOSDemo ****

"C:\ti\ccsv8\utils\bin\gmake" -k clean

DEL /F "RTOSDemo.bin" "RTOSDemo.out" DEL /F "main.obj" "FreeRTOSSourcecroutine.obj" "FreeRTOSSourceeventgroups.obj" "FreeRTOSSourcelist.obj" "FreeRTOSSourcequeue.obj" "FreeRTOSSourcestreambuffer.obj" "FreeRTOSSourcetasks.obj" "FreeRTOSSourcetimers.obj" "FreeRTOSSourceportableCCSARMCM4Fport.obj" "FreeRTOSSourceportableCCSARMCM4Fportasm.obj" "FreeRTOSSourceportableMemMangheap4.obj" "FullDemoFreeRTOS+CLIFreeRTOSCLI.obj" "FullDemoIntQueueTimer.obj" "FullDemoRegTest.obj" "FullDemoRunTimeStatsTimer.obj" "FullDemoSample-CLI-commands.obj" "FullDemoUARTCommandConsole.obj" "FullDemomainfull.obj" "FullDemoserial.obj" "FullDemoStandardDemoTasksEventGroupsDemo.obj" "FullDemoStandardDemoTasksGenQTest.obj" "FullDemoStandardDemoTasksIntQueue.obj" "FullDemoStandardDemoTasksIntSemTest.obj" "FullDemoStandardDemoTasksTaskNotify.obj" "FullDemoStandardDemoTasksTimerDemo.obj" "FullDemoStandardDemoTaskscountsem.obj" "FullDemoStandardDemoTasksrecmutex.obj" "FullDemoStandardDemoTaskssemtest.obj" DEL /F "FullDemoStandardDemoTasksspflop.obj" "SimplyBlinkyDemomainblinky.obj" "driverlibcpu.obj" "driverlibcs.obj" "driverlibflash.obj" "driverlibfpu.obj" "driverlibgpio.obj" "driverlibinterrupt.obj" "driverlibpcm.obj" "driverlibsysctl.obj" "driverlibtimer32.obj" "driverlibuart.obj" "driverlibwdta.obj" "systemCCSmsp432startupccs.obj" "systemCCSprintf-stdarg.obj" "systemCCSsystemmsp432p401r.obj" DEL /F "main.d" "FreeRTOSSourcecroutine.d" "FreeRTOSSourceeventgroups.d" "FreeRTOSSourcelist.d" "FreeRTOSSourcequeue.d" "FreeRTOSSourcestreambuffer.d" "FreeRTOSSourcetasks.d" "FreeRTOSSourcetimers.d" "FreeRTOSSourceportableCCSARMCM4Fport.d" "FreeRTOSSourceportableMemMangheap4.d" "FullDemoFreeRTOS+CLIFreeRTOSCLI.d" "FullDemoIntQueueTimer.d" "FullDemoRunTimeStatsTimer.d" "FullDemoSample-CLI-commands.d" "FullDemoUARTCommandConsole.d" "FullDemomainfull.d" "FullDemoserial.d" "FullDemoStandardDemoTasksEventGroupsDemo.d" "FullDemoStandardDemoTasksGenQTest.d" "FullDemoStandardDemoTasksIntQueue.d" "FullDemoStandardDemoTasksIntSemTest.d" "FullDemoStandardDemoTasksTaskNotify.d" "FullDemoStandardDemoTasksTimerDemo.d" "FullDemoStandardDemoTaskscountsem.d" "FullDemoStandardDemoTasksrecmutex.d" "FullDemoStandardDemoTaskssemtest.d" "FullDemoStandardDemoTasksspflop.d" "SimplyBlinkyDemomainblinky.d" "driverlibcpu.d" DEL /F "driverlibcs.d" "driverlibflash.d" "driverlibfpu.d" "driverlibgpio.d" "driverlibinterrupt.d" "driverlibpcm.d" "driverlibsysctl.d" "driverlibtimer32.d" "driverlibuart.d" "driverlibwdta.d" "systemCCSmsp432startupccs.d" "systemCCSprintf-stdarg.d" "systemCCSsystemmsp432p401r.d" DEL /F "FreeRTOSSourceportableCCSARMCM4Fportasm.d" "FullDemoRegTest.d" Could Not Find C:tiworkspaceRTOSDemoDebugRTOSDemo.bin Could Not Find C:tiworkspaceRTOSDemoDebugFreeRTOSSourceportableCCSARMCM4Fportasm.d Finished clean

**** Build Finished ****

**** Build of configuration Debug for project RTOSDemo ****

"C:\ti\ccsv8\utils\bin\gmake" -k all

Building file: "../main.c" Invoking: ARM Compiler "C:/ti/ccsv8/tools/compiler/ti-cgt-arm18.12.0.LTS/bin/armcl" -mv7M4 --codestate=16 --floatsupport=FPv4SPD16 -me -O0 --optforspeed=2 --includepath="C:/ti/ccsv8/ccsbase/arm/include" --includepath="C:/ti/workspace/RTOSDemo/FullDemo" --includepath="C:/ti/workspace/RTOSDemo/driverlib/inc" --includepath="C:/ti/workspace/RTOSDemo/driverlib" --includepath="C:/FREERTOS/FreeRTOSv10.1.1/FreeRTOS-Plus/Source/FreeRTOS-Plus-CLI" --includepath="C:/FREERTOS/FreeRTOSv10.1.1/FreeRTOS/Demo/Common/include" --includepath="C:/FREERTOS/FreeRTOSv10.1.1/FreeRTOS/Source/include" --includepath="C:/FREERTOS/FreeRTOSv10.1.1/FreeRTOS/Source/portable/CCS/ARMCM4F" --includepath="C:/ti/ccsv8/tools/compiler/ti-cgt-arm18.12.0.LTS/include" --includepath="C:/ti/ccsv8/tools/compiler/ti-cgt-arm18.12.0.LTS/include/" --includepath="C:/ti/ccsv8/ccsbase/arm/include/" --includepath="C:/ti/ccsv8/ccsbase/arm/include/CMSIS" --includepath="C:/ti/workspace/RTOSDemo" --define=MSP432P401R --define=USECMSISREGISTERFORMAT=1 --define=TARGETISMSP432P4XX --define=ccs -g --gcc --diagwarning=225 --diagwrap=off --displayerrornumber --verbosediagnostics --genfuncsubsections=on --abi=eabi --preprocwithcompile --preprocdependency="main.d_raw" "../main.c" Finished building: "../main.c"

Building file: "C:/FREERTOS/FreeRTOSv10.1.1/FreeRTOS/Source/croutine.c" Invoking: ARM Compiler "C:/ti/ccsv8/tools/compiler/ti-cgt-arm18.12.0.LTS/bin/armcl" -mv7M4 --codestate=16 --floatsupport=FPv4SPD16 -me -O0 --optforspeed=2 --includepath="C:/ti/ccsv8/ccsbase/arm/include" --includepath="C:/ti/workspace/RTOSDemo/FullDemo" --includepath="C:/ti/workspace/RTOSDemo/driverlib/inc" --includepath="C:/ti/workspace/RTOSDemo/driverlib" --includepath="C:/FREERTOS/FreeRTOSv10.1.1/FreeRTOS-Plus/Source/FreeRTOS-Plus-CLI" --includepath="C:/FREERTOS/FreeRTOSv10.1.1/FreeRTOS/Demo/Common/include" --includepath="C:/FREERTOS/FreeRTOSv10.1.1/FreeRTOS/Source/include" --includepath="C:/FREERTOS/FreeRTOSv10.1.1/FreeRTOS/Source/portable/CCS/ARMCM4F" --includepath="C:/ti/ccsv8/tools/compiler/ti-cgt-arm18.12.0.LTS/include" --includepath="C:/ti/ccsv8/tools/compiler/ti-cgt-arm18.12.0.LTS/include/" --includepath="C:/ti/ccsv8/ccsbase/arm/include/" --includepath="C:/ti/ccsv8/ccsbase/arm/include/CMSIS" --includepath="C:/ti/workspace/RTOSDemo" --define=MSP432P401R --define=USECMSISREGISTERFORMAT=1 --define=TARGETISMSP432P4XX --define=ccs -g --gcc --diagwarning=225 --diagwrap=off --displayerrornumber --verbosediagnostics --genfuncsubsections=on --abi=eabi --preprocwithcompile --preprocdependency="FreeRTOSSource/croutine.draw" --objdirectory="FreeRTOSSource" "C:/FREERTOS/FreeRTOSv10.1.1/FreeRTOS/Source/croutine.c" Finished building: "C:/FREERTOS/FreeRTOSv10.1.1/FreeRTOS/Source/croutine.c"

Building file: "C:/FREERTOS/FreeRTOSv10.1.1/FreeRTOS/Source/eventgroups.c" Invoking: ARM Compiler "C:/ti/ccsv8/tools/compiler/ti-cgt-arm18.12.0.LTS/bin/armcl" -mv7M4 --codestate=16 --floatsupport=FPv4SPD16 -me -O0 --optforspeed=2 --includepath="C:/ti/ccsv8/ccsbase/arm/include" --includepath="C:/ti/workspace/RTOSDemo/FullDemo" --includepath="C:/ti/workspace/RTOSDemo/driverlib/inc" --includepath="C:/ti/workspace/RTOSDemo/driverlib" --includepath="C:/FREERTOS/FreeRTOSv10.1.1/FreeRTOS-Plus/Source/FreeRTOS-Plus-CLI" --includepath="C:/FREERTOS/FreeRTOSv10.1.1/FreeRTOS/Demo/Common/include" --includepath="C:/FREERTOS/FreeRTOSv10.1.1/FreeRTOS/Source/include" --includepath="C:/FREERTOS/FreeRTOSv10.1.1/FreeRTOS/Source/portable/CCS/ARMCM4F" --includepath="C:/ti/ccsv8/tools/compiler/ti-cgt-arm18.12.0.LTS/include" --includepath="C:/ti/ccsv8/tools/compiler/ti-cgt-arm18.12.0.LTS/include/" --includepath="C:/ti/ccsv8/ccsbase/arm/include/" --includepath="C:/ti/ccsv8/ccsbase/arm/include/CMSIS" --includepath="C:/ti/workspace/RTOSDemo" --define=MSP432P401R --define=USECMSISREGISTERFORMAT=1 --define=TARGETISMSP432P4XX --define=ccs -g --gcc --diagwarning=225 --diagwrap=off --displayerrornumber --verbosediagnostics --genfuncsubsections=on --abi=eabi --preprocwithcompile --preprocdependency="FreeRTOSSource/eventgroups.draw" --objdirectory="FreeRTOSSource" "C:/FREERTOS/FreeRTOSv10.1.1/FreeRTOS/Source/eventgroups.c" Finished building: "C:/FREERTOS/FreeRTOSv10.1.1/FreeRTOS/Source/eventgroups.c"

Building file: "C:/FREERTOS/FreeRTOSv10.1.1/FreeRTOS/Source/list.c" Invoking: ARM Compiler "C:/ti/ccsv8/tools/compiler/ti-cgt-arm18.12.0.LTS/bin/armcl" -mv7M4 --codestate=16 --floatsupport=FPv4SPD16 -me -O0 --optforspeed=2 --includepath="C:/ti/ccsv8/ccsbase/arm/include" --includepath="C:/ti/workspace/RTOSDemo/FullDemo" --includepath="C:/ti/workspace/RTOSDemo/driverlib/inc" --includepath="C:/ti/workspace/RTOSDemo/driverlib" --includepath="C:/FREERTOS/FreeRTOSv10.1.1/FreeRTOS-Plus/Source/FreeRTOS-Plus-CLI" --includepath="C:/FREERTOS/FreeRTOSv10.1.1/FreeRTOS/Demo/Common/include" --includepath="C:/FREERTOS/FreeRTOSv10.1.1/FreeRTOS/Source/include" --includepath="C:/FREERTOS/FreeRTOSv10.1.1/FreeRTOS/Source/portable/CCS/ARMCM4F" --includepath="C:/ti/ccsv8/tools/compiler/ti-cgt-arm18.12.0.LTS/include" --includepath="C:/ti/ccsv8/tools/compiler/ti-cgt-arm18.12.0.LTS/include/" --includepath="C:/ti/ccsv8/ccsbase/arm/include/" --includepath="C:/ti/ccsv8/ccsbase/arm/include/CMSIS" --includepath="C:/ti/workspace/RTOSDemo" --define=MSP432P401R --define=USECMSISREGISTERFORMAT=1 --define=TARGETISMSP432P4XX --define=ccs -g --gcc --diagwarning=225 --diagwrap=off --displayerrornumber --verbosediagnostics --genfuncsubsections=on --abi=eabi --preprocwithcompile --preprocdependency="FreeRTOSSource/list.draw" --objdirectory="FreeRTOSSource" "C:/FREERTOS/FreeRTOSv10.1.1/FreeRTOS/Source/list.c" Finished building: "C:/FREERTOS/FreeRTOSv10.1.1/FreeRTOS/Source/list.c"

Building file: "C:/FREERTOS/FreeRTOSv10.1.1/FreeRTOS/Source/queue.c" Invoking: ARM Compiler "C:/ti/ccsv8/tools/compiler/ti-cgt-arm18.12.0.LTS/bin/armcl" -mv7M4 --codestate=16 --floatsupport=FPv4SPD16 -me -O0 --optforspeed=2 --includepath="C:/ti/ccsv8/ccsbase/arm/include" --includepath="C:/ti/workspace/RTOSDemo/FullDemo" --includepath="C:/ti/workspace/RTOSDemo/driverlib/inc" --includepath="C:/ti/workspace/RTOSDemo/driverlib" --includepath="C:/FREERTOS/FreeRTOSv10.1.1/FreeRTOS-Plus/Source/FreeRTOS-Plus-CLI" --includepath="C:/FREERTOS/FreeRTOSv10.1.1/FreeRTOS/Demo/Common/include" --includepath="C:/FREERTOS/FreeRTOSv10.1.1/FreeRTOS/Source/include" --includepath="C:/FREERTOS/FreeRTOSv10.1.1/FreeRTOS/Source/portable/CCS/ARMCM4F" --includepath="C:/ti/ccsv8/tools/compiler/ti-cgt-arm18.12.0.LTS/include" --includepath="C:/ti/ccsv8/tools/compiler/ti-cgt-arm18.12.0.LTS/include/" --includepath="C:/ti/ccsv8/ccsbase/arm/include/" --includepath="C:/ti/ccsv8/ccsbase/arm/include/CMSIS" --includepath="C:/ti/workspace/RTOSDemo" --define=MSP432P401R --define=USECMSISREGISTERFORMAT=1 --define=TARGETISMSP432P4XX --define=ccs -g --gcc --diagwarning=225 --diagwrap=off --displayerrornumber --verbosediagnostics --genfuncsubsections=on --abi=eabi --preprocwithcompile --preprocdependency="FreeRTOSSource/queue.draw" --objdirectory="FreeRTOSSource" "C:/FREERTOS/FreeRTOSv10.1.1/FreeRTOS/Source/queue.c" Finished building: "C:/FREERTOS/FreeRTOSv10.1.1/FreeRTOS/Source/queue.c"

Building file: "C:/FREERTOS/FreeRTOSv10.1.1/FreeRTOS/Source/streambuffer.c" Invoking: ARM Compiler "C:/ti/ccsv8/tools/compiler/ti-cgt-arm18.12.0.LTS/bin/armcl" -mv7M4 --codestate=16 --floatsupport=FPv4SPD16 -me -O0 --optforspeed=2 --includepath="C:/ti/ccsv8/ccsbase/arm/include" --includepath="C:/ti/workspace/RTOSDemo/FullDemo" --includepath="C:/ti/workspace/RTOSDemo/driverlib/inc" --includepath="C:/ti/workspace/RTOSDemo/driverlib" --includepath="C:/FREERTOS/FreeRTOSv10.1.1/FreeRTOS-Plus/Source/FreeRTOS-Plus-CLI" --includepath="C:/FREERTOS/FreeRTOSv10.1.1/FreeRTOS/Demo/Common/include" --includepath="C:/FREERTOS/FreeRTOSv10.1.1/FreeRTOS/Source/include" --includepath="C:/FREERTOS/FreeRTOSv10.1.1/FreeRTOS/Source/portable/CCS/ARMCM4F" --includepath="C:/ti/ccsv8/tools/compiler/ti-cgt-arm18.12.0.LTS/include" --includepath="C:/ti/ccsv8/tools/compiler/ti-cgt-arm18.12.0.LTS/include/" --includepath="C:/ti/ccsv8/ccsbase/arm/include/" --includepath="C:/ti/ccsv8/ccsbase/arm/include/CMSIS" --includepath="C:/ti/workspace/RTOSDemo" --define=MSP432P401R --define=USECMSISREGISTERFORMAT=1 --define=TARGETISMSP432P4XX --define=ccs -g --gcc --diagwarning=225 --diagwrap=off --displayerrornumber --verbosediagnostics --genfuncsubsections=on --abi=eabi --preprocwithcompile --preprocdependency="FreeRTOSSource/streambuffer.draw" --objdirectory="FreeRTOSSource" "C:/FREERTOS/FreeRTOSv10.1.1/FreeRTOS/Source/streambuffer.c" Finished building: "C:/FREERTOS/FreeRTOSv10.1.1/FreeRTOS/Source/streambuffer.c"

Building file: "C:/FREERTOS/FreeRTOSv10.1.1/FreeRTOS/Source/tasks.c" Invoking: ARM Compiler "C:/ti/ccsv8/tools/compiler/ti-cgt-arm18.12.0.LTS/bin/armcl" -mv7M4 --codestate=16 --floatsupport=FPv4SPD16 -me -O0 --optforspeed=2 --includepath="C:/ti/ccsv8/ccsbase/arm/include" --includepath="C:/ti/workspace/RTOSDemo/FullDemo" --includepath="C:/ti/workspace/RTOSDemo/driverlib/inc" --includepath="C:/ti/workspace/RTOSDemo/driverlib" --includepath="C:/FREERTOS/FreeRTOSv10.1.1/FreeRTOS-Plus/Source/FreeRTOS-Plus-CLI" --includepath="C:/FREERTOS/FreeRTOSv10.1.1/FreeRTOS/Demo/Common/include" --includepath="C:/FREERTOS/FreeRTOSv10.1.1/FreeRTOS/Source/include" --includepath="C:/FREERTOS/FreeRTOSv10.1.1/FreeRTOS/Source/portable/CCS/ARMCM4F" --includepath="C:/ti/ccsv8/tools/compiler/ti-cgt-arm18.12.0.LTS/include" --includepath="C:/ti/ccsv8/tools/compiler/ti-cgt-arm18.12.0.LTS/include/" --includepath="C:/ti/ccsv8/ccsbase/arm/include/" --includepath="C:/ti/ccsv8/ccsbase/arm/include/CMSIS" --includepath="C:/ti/workspace/RTOSDemo" --define=MSP432P401R --define=USECMSISREGISTERFORMAT=1 --define=TARGETISMSP432P4XX --define=ccs -g --gcc --diagwarning=225 --diagwrap=off --displayerrornumber --verbosediagnostics --genfuncsubsections=on --abi=eabi --preprocwithcompile --preprocdependency="FreeRTOSSource/tasks.draw" --objdirectory="FreeRTOSSource" "C:/FREERTOS/FreeRTOSv10.1.1/FreeRTOS/Source/tasks.c" Finished building: "C:/FREERTOS/FreeRTOSv10.1.1/FreeRTOS/Source/tasks.c"

Building file: "C:/FREERTOS/FreeRTOSv10.1.1/FreeRTOS/Source/timers.c" Invoking: ARM Compiler "C:/ti/ccsv8/tools/compiler/ti-cgt-arm18.12.0.LTS/bin/armcl" -mv7M4 --codestate=16 --floatsupport=FPv4SPD16 -me -O0 --optforspeed=2 --includepath="C:/ti/ccsv8/ccsbase/arm/include" --includepath="C:/ti/workspace/RTOSDemo/FullDemo" --includepath="C:/ti/workspace/RTOSDemo/driverlib/inc" --includepath="C:/ti/workspace/RTOSDemo/driverlib" --includepath="C:/FREERTOS/FreeRTOSv10.1.1/FreeRTOS-Plus/Source/FreeRTOS-Plus-CLI" --includepath="C:/FREERTOS/FreeRTOSv10.1.1/FreeRTOS/Demo/Common/include" --includepath="C:/FREERTOS/FreeRTOSv10.1.1/FreeRTOS/Source/include" --includepath="C:/FREERTOS/FreeRTOSv10.1.1/FreeRTOS/Source/portable/CCS/ARMCM4F" --includepath="C:/ti/ccsv8/tools/compiler/ti-cgt-arm18.12.0.LTS/include" --includepath="C:/ti/ccsv8/tools/compiler/ti-cgt-arm18.12.0.LTS/include/" --includepath="C:/ti/ccsv8/ccsbase/arm/include/" --includepath="C:/ti/ccsv8/ccsbase/arm/include/CMSIS" --includepath="C:/ti/workspace/RTOSDemo" --define=MSP432P401R --define=USECMSISREGISTERFORMAT=1 --define=TARGETISMSP432P4XX --define=ccs -g --gcc --diagwarning=225 --diagwrap=off --displayerrornumber --verbosediagnostics --genfuncsubsections=on --abi=eabi --preprocwithcompile --preprocdependency="FreeRTOSSource/timers.draw" --objdirectory="FreeRTOSSource" "C:/FREERTOS/FreeRTOSv10.1.1/FreeRTOS/Source/timers.c" Finished building: "C:/FREERTOS/FreeRTOSv10.1.1/FreeRTOS/Source/timers.c"

Building file: "C:/FREERTOS/FreeRTOSv10.1.1/FreeRTOS/Source/portable/CCS/ARMCM4F/port.c" Invoking: ARM Compiler "C:/ti/ccsv8/tools/compiler/ti-cgt-arm18.12.0.LTS/bin/armcl" -mv7M4 --codestate=16 --floatsupport=FPv4SPD16 -me -O0 --optforspeed=2 --includepath="C:/ti/ccsv8/ccsbase/arm/include" --includepath="C:/ti/workspace/RTOSDemo/FullDemo" --includepath="C:/ti/workspace/RTOSDemo/driverlib/inc" --includepath="C:/ti/workspace/RTOSDemo/driverlib" --includepath="C:/FREERTOS/FreeRTOSv10.1.1/FreeRTOS-Plus/Source/FreeRTOS-Plus-CLI" --includepath="C:/FREERTOS/FreeRTOSv10.1.1/FreeRTOS/Demo/Common/include" --includepath="C:/FREERTOS/FreeRTOSv10.1.1/FreeRTOS/Source/include" --includepath="C:/FREERTOS/FreeRTOSv10.1.1/FreeRTOS/Source/portable/CCS/ARMCM4F" --includepath="C:/ti/ccsv8/tools/compiler/ti-cgt-arm18.12.0.LTS/include" --includepath="C:/ti/ccsv8/tools/compiler/ti-cgt-arm18.12.0.LTS/include/" --includepath="C:/ti/ccsv8/ccsbase/arm/include/" --includepath="C:/ti/ccsv8/ccsbase/arm/include/CMSIS" --includepath="C:/ti/workspace/RTOSDemo" --define=MSP432P401R --define=USECMSISREGISTERFORMAT=1 --define=TARGETISMSP432P4XX --define=ccs -g --gcc --diagwarning=225 --diagwrap=off --displayerrornumber --verbosediagnostics --genfuncsubsections=on --abi=eabi --preprocwithcompile --preprocdependency="FreeRTOSSource/portable/CCS/ARMCM4F/port.draw" --objdirectory="FreeRTOSSource/portable/CCS/ARMCM4F" "C:/FREERTOS/FreeRTOSv10.1.1/FreeRTOS/Source/portable/CCS/ARMCM4F/port.c" Finished building: "C:/FREERTOS/FreeRTOSv10.1.1/FreeRTOS/Source/portable/CCS/ARM_CM4F/port.c"

Building file: "C:/FREERTOS/FreeRTOSv10.1.1/FreeRTOS/Source/portable/CCS/ARMCM4F/portasm.asm" Invoking: ARM Compiler "C:/ti/ccsv8/tools/compiler/ti-cgt-arm18.12.0.LTS/bin/armcl" -mv7M4 --codestate=16 --floatsupport=FPv4SPD16 -me -O0 --optforspeed=2 --includepath="C:/ti/ccsv8/ccsbase/arm/include" --includepath="C:/ti/workspace/RTOSDemo/FullDemo" --includepath="C:/ti/workspace/RTOSDemo/driverlib/inc" --includepath="C:/ti/workspace/RTOSDemo/driverlib" --includepath="C:/FREERTOS/FreeRTOSv10.1.1/FreeRTOS-Plus/Source/FreeRTOS-Plus-CLI" --includepath="C:/FREERTOS/FreeRTOSv10.1.1/FreeRTOS/Demo/Common/include" --includepath="C:/FREERTOS/FreeRTOSv10.1.1/FreeRTOS/Source/include" --includepath="C:/FREERTOS/FreeRTOSv10.1.1/FreeRTOS/Source/portable/CCS/ARMCM4F" --includepath="C:/ti/ccsv8/tools/compiler/ti-cgt-arm18.12.0.LTS/include" --includepath="C:/ti/ccsv8/tools/compiler/ti-cgt-arm18.12.0.LTS/include/" --includepath="C:/ti/ccsv8/ccsbase/arm/include/" --includepath="C:/ti/ccsv8/ccsbase/arm/include/CMSIS" --includepath="C:/ti/workspace/RTOSDemo" --define=MSP432P401R --define=USECMSISREGISTERFORMAT=1 --define=TARGETISMSP432P4XX --define=ccs -g --gcc --diagwarning=225 --diagwrap=off --displayerrornumber --verbosediagnostics --genfuncsubsections=on --abi=eabi --preprocwithcompile --preprocdependency="FreeRTOSSource/portable/CCS/ARMCM4F/portasm.draw" --objdirectory="FreeRTOSSource/portable/CCS/ARMCM4F" "C:/FREERTOS/FreeRTOSv10.1.1/FreeRTOS/Source/portable/CCS/ARMCM4F/portasm.asm" Finished building: "C:/FREERTOS/FreeRTOSv10.1.1/FreeRTOS/Source/portable/CCS/ARM_CM4F/portasm.asm"

Building file: "C:/FREERTOS/FreeRTOSv10.1.1/FreeRTOS/Source/portable/MemMang/heap4.c" Invoking: ARM Compiler "C:/ti/ccsv8/tools/compiler/ti-cgt-arm18.12.0.LTS/bin/armcl" -mv7M4 --codestate=16 --floatsupport=FPv4SPD16 -me -O0 --optforspeed=2 --includepath="C:/ti/ccsv8/ccsbase/arm/include" --includepath="C:/ti/workspace/RTOSDemo/FullDemo" --includepath="C:/ti/workspace/RTOSDemo/driverlib/inc" --includepath="C:/ti/workspace/RTOSDemo/driverlib" --includepath="C:/FREERTOS/FreeRTOSv10.1.1/FreeRTOS-Plus/Source/FreeRTOS-Plus-CLI" --includepath="C:/FREERTOS/FreeRTOSv10.1.1/FreeRTOS/Demo/Common/include" --includepath="C:/FREERTOS/FreeRTOSv10.1.1/FreeRTOS/Source/include" --includepath="C:/FREERTOS/FreeRTOSv10.1.1/FreeRTOS/Source/portable/CCS/ARMCM4F" --includepath="C:/ti/ccsv8/tools/compiler/ti-cgt-arm18.12.0.LTS/include" --includepath="C:/ti/ccsv8/tools/compiler/ti-cgt-arm18.12.0.LTS/include/" --includepath="C:/ti/ccsv8/ccsbase/arm/include/" --includepath="C:/ti/ccsv8/ccsbase/arm/include/CMSIS" --includepath="C:/ti/workspace/RTOSDemo" --define=MSP432P401R --define=USECMSISREGISTERFORMAT=1 --define=TARGETISMSP432P4XX --define=ccs -g --gcc --diagwarning=225 --diagwrap=off --displayerrornumber --verbosediagnostics --genfuncsubsections=on --abi=eabi --preprocwithcompile --preprocdependency="FreeRTOSSource/portable/MemMang/heap4.draw" --objdirectory="FreeRTOSSource/portable/MemMang" "C:/FREERTOS/FreeRTOSv10.1.1/FreeRTOS/Source/portable/MemMang/heap4.c" Finished building: "C:/FREERTOS/FreeRTOSv10.1.1/FreeRTOS/Source/portable/MemMang/heap4.c"

Building file: "C:/FREERTOS/FreeRTOSv10.1.1/FreeRTOS-Plus/Source/FreeRTOS-Plus-CLI/FreeRTOSCLI.c" Invoking: ARM Compiler "C:/ti/ccsv8/tools/compiler/ti-cgt-arm18.12.0.LTS/bin/armcl" -mv7M4 --codestate=16 --floatsupport=FPv4SPD16 -me -O0 --optforspeed=2 --includepath="C:/ti/ccsv8/ccsbase/arm/include" --includepath="C:/ti/workspace/RTOSDemo/FullDemo" --includepath="C:/ti/workspace/RTOSDemo/driverlib/inc" --includepath="C:/ti/workspace/RTOSDemo/driverlib" --includepath="C:/FREERTOS/FreeRTOSv10.1.1/FreeRTOS-Plus/Source/FreeRTOS-Plus-CLI" --includepath="C:/FREERTOS/FreeRTOSv10.1.1/FreeRTOS/Demo/Common/include" --includepath="C:/FREERTOS/FreeRTOSv10.1.1/FreeRTOS/Source/include" --includepath="C:/FREERTOS/FreeRTOSv10.1.1/FreeRTOS/Source/portable/CCS/ARMCM4F" --includepath="C:/ti/ccsv8/tools/compiler/ti-cgt-arm18.12.0.LTS/include" --includepath="C:/ti/ccsv8/tools/compiler/ti-cgt-arm18.12.0.LTS/include/" --includepath="C:/ti/ccsv8/ccsbase/arm/include/" --includepath="C:/ti/ccsv8/ccsbase/arm/include/CMSIS" --includepath="C:/ti/workspace/RTOSDemo" --define=MSP432P401R --define=USECMSISREGISTERFORMAT=1 --define=TARGETISMSP432P4XX --define=ccs -g --gcc --diagwarning=225 --diagwrap=off --displayerrornumber --verbosediagnostics --genfuncsubsections=on --abi=eabi --preprocwithcompile --preprocdependency="FullDemo/FreeRTOS+CLI/FreeRTOSCLI.draw" --objdirectory="FullDemo/FreeRTOS+CLI" "C:/FREERTOS/FreeRTOSv10.1.1/FreeRTOS-Plus/Source/FreeRTOS-Plus-CLI/FreeRTOSCLI.c" Finished building: "C:/FREERTOS/FreeRTOSv10.1.1/FreeRTOS-Plus/Source/FreeRTOS-Plus-CLI/FreeRTOSCLI.c"

Building file: "../FullDemo/IntQueueTimer.c" Invoking: ARM Compiler "C:/ti/ccsv8/tools/compiler/ti-cgt-arm18.12.0.LTS/bin/armcl" -mv7M4 --codestate=16 --floatsupport=FPv4SPD16 -me -O0 --optforspeed=2 --includepath="C:/ti/ccsv8/ccsbase/arm/include" --includepath="C:/ti/workspace/RTOSDemo/FullDemo" --includepath="C:/ti/workspace/RTOSDemo/driverlib/inc" --includepath="C:/ti/workspace/RTOSDemo/driverlib" --includepath="C:/FREERTOS/FreeRTOSv10.1.1/FreeRTOS-Plus/Source/FreeRTOS-Plus-CLI" --includepath="C:/FREERTOS/FreeRTOSv10.1.1/FreeRTOS/Demo/Common/include" --includepath="C:/FREERTOS/FreeRTOSv10.1.1/FreeRTOS/Source/include" --includepath="C:/FREERTOS/FreeRTOSv10.1.1/FreeRTOS/Source/portable/CCS/ARMCM4F" --includepath="C:/ti/ccsv8/tools/compiler/ti-cgt-arm18.12.0.LTS/include" --includepath="C:/ti/ccsv8/tools/compiler/ti-cgt-arm18.12.0.LTS/include/" --includepath="C:/ti/ccsv8/ccsbase/arm/include/" --includepath="C:/ti/ccsv8/ccsbase/arm/include/CMSIS" --includepath="C:/ti/workspace/RTOSDemo" --define=MSP432P401R --define=USECMSISREGISTERFORMAT=1 --define=TARGETISMSP432P4XX --define=ccs -g --gcc --diagwarning=225 --diagwrap=off --displayerrornumber --verbosediagnostics --genfuncsubsections=on --abi=eabi --preprocwithcompile --preprocdependency="FullDemo/IntQueueTimer.draw" --objdirectory="FullDemo" "../FullDemo/IntQueueTimer.c" Finished building: "../Full_Demo/IntQueueTimer.c"

Building file: "../FullDemo/RegTest.c" Invoking: ARM Compiler "C:/ti/ccsv8/tools/compiler/ti-cgt-arm18.12.0.LTS/bin/armcl" -mv7M4 --codestate=16 --floatsupport=FPv4SPD16 -me -O0 --optforspeed=2 --includepath="C:/ti/ccsv8/ccsbase/arm/include" --includepath="C:/ti/workspace/RTOSDemo/FullDemo" --includepath="C:/ti/workspace/RTOSDemo/driverlib/inc" --includepath="C:/ti/workspace/RTOSDemo/driverlib" --includepath="C:/FREERTOS/FreeRTOSv10.1.1/FreeRTOS-Plus/Source/FreeRTOS-Plus-CLI" --includepath="C:/FREERTOS/FreeRTOSv10.1.1/FreeRTOS/Demo/Common/include" --includepath="C:/FREERTOS/FreeRTOSv10.1.1/FreeRTOS/Source/include" --includepath="C:/FREERTOS/FreeRTOSv10.1.1/FreeRTOS/Source/portable/CCS/ARMCM4F" --includepath="C:/ti/ccsv8/tools/compiler/ti-cgt-arm18.12.0.LTS/include" --includepath="C:/ti/ccsv8/tools/compiler/ti-cgt-arm18.12.0.LTS/include/" --includepath="C:/ti/ccsv8/ccsbase/arm/include/" --includepath="C:/ti/ccsv8/ccsbase/arm/include/CMSIS" --includepath="C:/ti/workspace/RTOSDemo" --define=MSP432P401R --define=USECMSISREGISTERFORMAT=1 --define=TARGETISMSP432P4XX --define=ccs -g --gcc --diagwarning=225 --diagwrap=off --displayerrornumber --verbosediagnostics --genfuncsubsections=on --abi=eabi --preprocwithcompile --preprocdependency="FullDemo/RegTest.draw" --objdirectory="FullDemo" "../FullDemo/RegTest.c"

Compilation failure FullDemo/subdirrules.mk:9: recipe for target 'FullDemo/RegTest.obj' failed "../FullDemo/RegTest.c", line 29: error #41: expected an identifier __asm void vRegTest1Implementation( void ) ^

"../Full_Demo/RegTest.c", line 31: error #20: identifier "PRESERVE8" is undefined PRESERVE8 ^

"../Full_Demo/RegTest.c", line 32: error #66: expected a ";" IMPORT ulRegTest1LoopCounter ^

"../Full_Demo/RegTest.c", line 35: error #10: "#" not expected here mov r0, #100 ^

"../Full_Demo/RegTest.c", line 36: error #10: "#" not expected here mov r1, #101 ^

"../Full_Demo/RegTest.c", line 37: error #10: "#" not expected here mov r2, #102 ^

"../Full_Demo/RegTest.c", line 38: error #10: "#" not expected here mov r3, #103 ^

"../Full_Demo/RegTest.c", line 39: error #10: "#" not expected here mov r4, #104 ^

"../Full_Demo/RegTest.c", line 40: error #10: "#" not expected here mov r5, #105 ^

"../Full_Demo/RegTest.c", line 41: error #10: "#" not expected here mov r6, #106 ^

"../Full_Demo/RegTest.c", line 42: error #10: "#" not expected here mov r7, #107 ^

"../Full_Demo/RegTest.c", line 43: error #10: "#" not expected here mov r8, #108 ^

"../Full_Demo/RegTest.c", line 44: error #10: "#" not expected here mov r9, #109 ^

"../Full_Demo/RegTest.c", line 45: error #10: "#" not expected here mov r10, #110 ^

"../Full_Demo/RegTest.c", line 46: error #10: "#" not expected here mov r11, #111 ^

"../Full_Demo/RegTest.c", line 47: error #10: "#" not expected here mov r12, #112 ^

"../Full_Demo/RegTest.c", line 73: error #10: "#" not expected here cmp r0, #100 ^

"../Full_Demo/RegTest.c", line 75: error #10: "#" not expected here cmp r1, #101 ^

"../Full_Demo/RegTest.c", line 78: error #10: "#" not expected here cmp r0, #102 ^

"../Full_Demo/RegTest.c", line 80: error #10: "#" not expected here cmp r1, #103 ^

"../Full_Demo/RegTest.c", line 83: error #10: "#" not expected here cmp r0, #104 ^

"../Full_Demo/RegTest.c", line 85: error #10: "#" not expected here cmp r1, #105 ^

"../Full_Demo/RegTest.c", line 88: error #10: "#" not expected here cmp r0, #106 ^

"../Full_Demo/RegTest.c", line 90: error #10: "#" not expected here cmp r1, #107 ^

"../Full_Demo/RegTest.c", line 93: error #10: "#" not expected here cmp r0, #108 ^

"../Full_Demo/RegTest.c", line 95: error #10: "#" not expected here cmp r1, #109 ^

"../Full_Demo/RegTest.c", line 98: error #10: "#" not expected here cmp r0, #110 ^

"../Full_Demo/RegTest.c", line 100: error #10: "#" not expected here cmp r1, #111 ^

"../Full_Demo/RegTest.c", line 103: error #10: "#" not expected here cmp r0, #100 ^

"../Full_Demo/RegTest.c", line 105: error #10: "#" not expected here cmp r1, #101 ^

"../Full_Demo/RegTest.c", line 108: error #10: "#" not expected here cmp r0, #102 ^

"../Full_Demo/RegTest.c", line 110: error #10: "#" not expected here cmp r1, #103 ^

"../Full_Demo/RegTest.c", line 113: error #10: "#" not expected here cmp r0, #104 ^

"../Full_Demo/RegTest.c", line 115: error #10: "#" not expected here cmp r1, #105 ^

"../Full_Demo/RegTest.c", line 118: error #10: "#" not expected here cmp r0, #106 ^

"../Full_Demo/RegTest.c", line 120: error #10: "#" not expected here cmp r1, #107 ^

"../Full_Demo/RegTest.c", line 123: error #10: "#" not expected here cmp r0, #108 ^

"../Full_Demo/RegTest.c", line 125: error #10: "#" not expected here cmp r1, #109 ^

"../Full_Demo/RegTest.c", line 128: error #10: "#" not expected here cmp r0, #110 ^

"../Full_Demo/RegTest.c", line 130: error #10: "#" not expected here cmp r1, #111 ^

"../Full_Demo/RegTest.c", line 133: error #10: "#" not expected here cmp r0, #100 ^

"../Full_Demo/RegTest.c", line 135: error #10: "#" not expected here cmp r1, #101 ^

"../Full_Demo/RegTest.c", line 138: error #10: "#" not expected here cmp r0, #102 ^

"../Full_Demo/RegTest.c", line 140: error #10: "#" not expected here cmp r1, #103 ^

"../Full_Demo/RegTest.c", line 143: error #10: "#" not expected here cmp r0, #104 ^

"../Full_Demo/RegTest.c", line 145: error #10: "#" not expected here cmp r1, #105 ^

"../Full_Demo/RegTest.c", line 148: error #10: "#" not expected here cmp r0, #106 ^

"../Full_Demo/RegTest.c", line 150: error #10: "#" not expected here cmp r1, #107 ^

"../Full_Demo/RegTest.c", line 166: error #10: "#" not expected here cmp r0, #100 ^

"../Full_Demo/RegTest.c", line 168: error #10: "#" not expected here cmp r1, #101 ^

"../Full_Demo/RegTest.c", line 170: error #10: "#" not expected here cmp r2, #102 ^

"../Full_Demo/RegTest.c", line 172: error #10: "#" not expected here cmp r3, #103 ^

"../Full_Demo/RegTest.c", line 174: error #10: "#" not expected here cmp r4, #104 ^

"../Full_Demo/RegTest.c", line 176: error #10: "#" not expected here cmp r5, #105 ^

"../Full_Demo/RegTest.c", line 178: error #10: "#" not expected here cmp r6, #106 ^

"../Full_Demo/RegTest.c", line 180: error #10: "#" not expected here cmp r7, #107 ^

"../Full_Demo/RegTest.c", line 182: error #10: "#" not expected here cmp r8, #108 ^

"../Full_Demo/RegTest.c", line 184: error #10: "#" not expected here cmp r9, #109 ^

"../Full_Demo/RegTest.c", line 186: error #10: "#" not expected here cmp r10, #110 ^

"../Full_Demo/RegTest.c", line 188: error #10: "#" not expected here cmp r11, #111 ^

"../Full_Demo/RegTest.c", line 190: error #10: "#" not expected here cmp r12, #112 ^

"../Full_Demo/RegTest.c", line 197: error #10: "#" not expected here adds r1, r1, #1 ^

"../Full_Demo/RegTest.c", line 209: warning #12-D: parsing restarts here after previous syntax error } ^

"../Full_Demo/RegTest.c", line 212: error #41: expected an identifier __asm void vRegTest2Implementation( void ) ^

"../Full_Demo/RegTest.c", line 214: error #20: identifier "PRESERVE8" is undefined PRESERVE8 ^

"../Full_Demo/RegTest.c", line 215: error #66: expected a ";" IMPORT ulRegTest2LoopCounter ^

"../Full_Demo/RegTest.c", line 218: error #10: "#" not expected here mov r0, #-1 ^

"../Full_Demo/RegTest.c", line 219: error #10: "#" not expected here mov r1, #1 ^

"../Full_Demo/RegTest.c", line 220: error #10: "#" not expected here mov r2, #2 ^

"../Full_Demo/RegTest.c", line 221: error #10: "#" not expected here mov r3, #3 ^

"../Full_Demo/RegTest.c", line 222: error #10: "#" not expected here mov r4, #4 ^

"../Full_Demo/RegTest.c", line 223: error #10: "#" not expected here mov r5, #5 ^

"../Full_Demo/RegTest.c", line 224: error #10: "#" not expected here mov r6, #6 ^

"../Full_Demo/RegTest.c", line 225: error #10: "#" not expected here mov r7, #7 ^

"../Full_Demo/RegTest.c", line 226: error #10: "#" not expected here mov r8, #8 ^

"../Full_Demo/RegTest.c", line 227: error #10: "#" not expected here mov r9, #9 ^

"../Full_Demo/RegTest.c", line 228: error #10: "#" not expected here mov r10, #10 ^

"../Full_Demo/RegTest.c", line 229: error #10: "#" not expected here mov r11, #11 ^

"../Full_Demo/RegTest.c", line 230: error #10: "#" not expected here mov r12, #12 ^

"../Full_Demo/RegTest.c", line 257: error #10: "#" not expected here cmp r0, #-1 ^

"../Full_Demo/RegTest.c", line 259: error #10: "#" not expected here cmp r1, #1 ^

"../Full_Demo/RegTest.c", line 262: error #10: "#" not expected here cmp r0, #2 ^

"../Full_Demo/RegTest.c", line 264: error #10: "#" not expected here cmp r1, #3 ^

"../Full_Demo/RegTest.c", line 267: error #10: "#" not expected here cmp r0, #4 ^

"../Full_Demo/RegTest.c", line 269: error #10: "#" not expected here cmp r1, #5 ^

"../Full_Demo/RegTest.c", line 272: error #10: "#" not expected here cmp r0, #6 ^

"../Full_Demo/RegTest.c", line 274: error #10: "#" not expected here cmp r1, #7 ^

"../Full_Demo/RegTest.c", line 277: error #10: "#" not expected here cmp r0, #8 ^

"../Full_Demo/RegTest.c", line 279: error #10: "#" not expected here cmp r1, #9 ^

"../Full_Demo/RegTest.c", line 282: error #10: "#" not expected here cmp r0, #10 ^

"../Full_Demo/RegTest.c", line 284: error #10: "#" not expected here cmp r1, #11 ^

"../Full_Demo/RegTest.c", line 287: error #10: "#" not expected here cmp r0, #-1 ^

"../Full_Demo/RegTest.c", line 289: error #10: "#" not expected here cmp r1, #1 ^

"../Full_Demo/RegTest.c", line 292: error #10: "#" not expected here cmp r0, #2 ^

"../Full_Demo/RegTest.c", line 294: error #10: "#" not expected here cmp r1, #3 ^

"../Full_Demo/RegTest.c", line 297: error #10: "#" not expected here cmp r0, #4 ^

"../Full_Demo/RegTest.c", line 299: error #10: "#" not expected here cmp r1, #5 ^

"../Full_Demo/RegTest.c", line 302: error #10: "#" not expected here cmp r0, #6 ^

"../Full_Demo/RegTest.c", line 304: error #10: "#" not expected here cmp r1, #7 ^

"../Full_Demo/RegTest.c", line 307: error #10: "#" not expected here cmp r0, #8 ^

"../Full_Demo/RegTest.c", line 309: error #10: "#" not expected here cmp r1, #9 ^

Error limit reached. 100 errors detected in the compilation of "../FullDemo/RegTest.c". Compilation terminated. gmake: *** [FullDemo/RegTest.obj] Error 1 Building file: "../FullDemo/RunTimeStatsTimer.c" Invoking: ARM Compiler "C:/ti/ccsv8/tools/compiler/ti-cgt-arm18.12.0.LTS/bin/armcl" -mv7M4 --codestate=16 --floatsupport=FPv4SPD16 -me -O0 --optforspeed=2 --includepath="C:/ti/ccsv8/ccsbase/arm/include" --includepath="C:/ti/workspace/RTOSDemo/FullDemo" --includepath="C:/ti/workspace/RTOSDemo/driverlib/inc" --includepath="C:/ti/workspace/RTOSDemo/driverlib" --includepath="C:/FREERTOS/FreeRTOSv10.1.1/FreeRTOS-Plus/Source/FreeRTOS-Plus-CLI" --includepath="C:/FREERTOS/FreeRTOSv10.1.1/FreeRTOS/Demo/Common/include" --includepath="C:/FREERTOS/FreeRTOSv10.1.1/FreeRTOS/Source/include" --includepath="C:/FREERTOS/FreeRTOSv10.1.1/FreeRTOS/Source/portable/CCS/ARMCM4F" --includepath="C:/ti/ccsv8/tools/compiler/ti-cgt-arm18.12.0.LTS/include" --includepath="C:/ti/ccsv8/tools/compiler/ti-cgt-arm18.12.0.LTS/include/" --includepath="C:/ti/ccsv8/ccsbase/arm/include/" --includepath="C:/ti/ccsv8/ccsbase/arm/include/CMSIS" --includepath="C:/ti/workspace/RTOSDemo" --define=MSP432P401R --define=USECMSISREGISTERFORMAT=1 --define=TARGETISMSP432P4XX --define=ccs -g --gcc --diagwarning=225 --diagwrap=off --displayerrornumber --verbosediagnostics --genfuncsubsections=on --abi=eabi --preprocwithcompile --preprocdependency="FullDemo/RunTimeStatsTimer.draw" --objdirectory="FullDemo" "../FullDemo/RunTimeStatsTimer.c" Finished building: "../Full_Demo/RunTimeStatsTimer.c"

Building file: "C:/FREERTOS/FreeRTOSv10.1.1/FreeRTOS-Plus/Demo/Common/FreeRTOSPlusCLIDemos/Sample-CLI-commands.c" Invoking: ARM Compiler "C:/ti/ccsv8/tools/compiler/ti-cgt-arm18.12.0.LTS/bin/armcl" -mv7M4 --codestate=16 --floatsupport=FPv4SPD16 -me -O0 --optforspeed=2 --includepath="C:/ti/ccsv8/ccsbase/arm/include" --includepath="C:/ti/workspace/RTOSDemo/FullDemo" --includepath="C:/ti/workspace/RTOSDemo/driverlib/inc" --includepath="C:/ti/workspace/RTOSDemo/driverlib" --includepath="C:/FREERTOS/FreeRTOSv10.1.1/FreeRTOS-Plus/Source/FreeRTOS-Plus-CLI" --includepath="C:/FREERTOS/FreeRTOSv10.1.1/FreeRTOS/Demo/Common/include" --includepath="C:/FREERTOS/FreeRTOSv10.1.1/FreeRTOS/Source/include" --includepath="C:/FREERTOS/FreeRTOSv10.1.1/FreeRTOS/Source/portable/CCS/ARMCM4F" --includepath="C:/ti/ccsv8/tools/compiler/ti-cgt-arm18.12.0.LTS/include" --includepath="C:/ti/ccsv8/tools/compiler/ti-cgt-arm18.12.0.LTS/include/" --includepath="C:/ti/ccsv8/ccsbase/arm/include/" --includepath="C:/ti/ccsv8/ccsbase/arm/include/CMSIS" --includepath="C:/ti/workspace/RTOSDemo" --define=MSP432P401R --define=USECMSISREGISTERFORMAT=1 --define=TARGETISMSP432P4XX --define=ccs -g --gcc --diagwarning=225 --diagwrap=off --displayerrornumber --verbosediagnostics --genfuncsubsections=on --abi=eabi --preprocwithcompile --preprocdependency="FullDemo/Sample-CLI-commands.draw" --objdirectory="FullDemo" "C:/FREERTOS/FreeRTOSv10.1.1/FreeRTOS-Plus/Demo/Common/FreeRTOSPlusCLIDemos/Sample-CLI-commands.c" Finished building: "C:/FREERTOS/FreeRTOSv10.1.1/FreeRTOS-Plus/Demo/Common/FreeRTOSPlusCLI_Demos/Sample-CLI-commands.c"

Building file: "C:/FREERTOS/FreeRTOSv10.1.1/FreeRTOS-Plus/Demo/Common/FreeRTOSPlusCLIDemos/UARTCommandConsole.c" Invoking: ARM Compiler "C:/ti/ccsv8/tools/compiler/ti-cgt-arm18.12.0.LTS/bin/armcl" -mv7M4 --codestate=16 --floatsupport=FPv4SPD16 -me -O0 --optforspeed=2 --includepath="C:/ti/ccsv8/ccsbase/arm/include" --includepath="C:/ti/workspace/RTOSDemo/FullDemo" --includepath="C:/ti/workspace/RTOSDemo/driverlib/inc" --includepath="C:/ti/workspace/RTOSDemo/driverlib" --includepath="C:/FREERTOS/FreeRTOSv10.1.1/FreeRTOS-Plus/Source/FreeRTOS-Plus-CLI" --includepath="C:/FREERTOS/FreeRTOSv10.1.1/FreeRTOS/Demo/Common/include" --includepath="C:/FREERTOS/FreeRTOSv10.1.1/FreeRTOS/Source/include" --includepath="C:/FREERTOS/FreeRTOSv10.1.1/FreeRTOS/Source/portable/CCS/ARMCM4F" --includepath="C:/ti/ccsv8/tools/compiler/ti-cgt-arm18.12.0.LTS/include" --includepath="C:/ti/ccsv8/tools/compiler/ti-cgt-arm18.12.0.LTS/include/" --includepath="C:/ti/ccsv8/ccsbase/arm/include/" --includepath="C:/ti/ccsv8/ccsbase/arm/include/CMSIS" --includepath="C:/ti/workspace/RTOSDemo" --define=MSP432P401R --define=USECMSISREGISTERFORMAT=1 --define=TARGETISMSP432P4XX --define=ccs -g --gcc --diagwarning=225 --diagwrap=off --displayerrornumber --verbosediagnostics --genfuncsubsections=on --abi=eabi --preprocwithcompile --preprocdependency="FullDemo/UARTCommandConsole.draw" --objdirectory="FullDemo" "C:/FREERTOS/FreeRTOSv10.1.1/FreeRTOS-Plus/Demo/Common/FreeRTOSPlusCLIDemos/UARTCommandConsole.c" Finished building: "C:/FREERTOS/FreeRTOSv10.1.1/FreeRTOS-Plus/Demo/Common/FreeRTOSPlusCLI_Demos/UARTCommandConsole.c"

Building file: "../FullDemo/mainfull.c" Invoking: ARM Compiler "C:/ti/ccsv8/tools/compiler/ti-cgt-arm18.12.0.LTS/bin/armcl" -mv7M4 --codestate=16 --floatsupport=FPv4SPD16 -me -O0 --optforspeed=2 --includepath="C:/ti/ccsv8/ccsbase/arm/include" --includepath="C:/ti/workspace/RTOSDemo/FullDemo" --includepath="C:/ti/workspace/RTOSDemo/driverlib/inc" --includepath="C:/ti/workspace/RTOSDemo/driverlib" --includepath="C:/FREERTOS/FreeRTOSv10.1.1/FreeRTOS-Plus/Source/FreeRTOS-Plus-CLI" --includepath="C:/FREERTOS/FreeRTOSv10.1.1/FreeRTOS/Demo/Common/include" --includepath="C:/FREERTOS/FreeRTOSv10.1.1/FreeRTOS/Source/include" --includepath="C:/FREERTOS/FreeRTOSv10.1.1/FreeRTOS/Source/portable/CCS/ARMCM4F" --includepath="C:/ti/ccsv8/tools/compiler/ti-cgt-arm18.12.0.LTS/include" --includepath="C:/ti/ccsv8/tools/compiler/ti-cgt-arm18.12.0.LTS/include/" --includepath="C:/ti/ccsv8/ccsbase/arm/include/" --includepath="C:/ti/ccsv8/ccsbase/arm/include/CMSIS" --includepath="C:/ti/workspace/RTOSDemo" --define=MSP432P401R --define=USECMSISREGISTERFORMAT=1 --define=TARGETISMSP432P4XX --define=ccs -g --gcc --diagwarning=225 --diagwrap=off --displayerrornumber --verbosediagnostics --genfuncsubsections=on --abi=eabi --preprocwithcompile --preprocdependency="FullDemo/mainfull.draw" --objdirectory="FullDemo" "../FullDemo/mainfull.c" Finished building: "../FullDemo/main_full.c"

Building file: "../FullDemo/serial.c" Invoking: ARM Compiler "C:/ti/ccsv8/tools/compiler/ti-cgt-arm18.12.0.LTS/bin/armcl" -mv7M4 --codestate=16 --floatsupport=FPv4SPD16 -me -O0 --optforspeed=2 --includepath="C:/ti/ccsv8/ccsbase/arm/include" --includepath="C:/ti/workspace/RTOSDemo/FullDemo" --includepath="C:/ti/workspace/RTOSDemo/driverlib/inc" --includepath="C:/ti/workspace/RTOSDemo/driverlib" --includepath="C:/FREERTOS/FreeRTOSv10.1.1/FreeRTOS-Plus/Source/FreeRTOS-Plus-CLI" --includepath="C:/FREERTOS/FreeRTOSv10.1.1/FreeRTOS/Demo/Common/include" --includepath="C:/FREERTOS/FreeRTOSv10.1.1/FreeRTOS/Source/include" --includepath="C:/FREERTOS/FreeRTOSv10.1.1/FreeRTOS/Source/portable/CCS/ARMCM4F" --includepath="C:/ti/ccsv8/tools/compiler/ti-cgt-arm18.12.0.LTS/include" --includepath="C:/ti/ccsv8/tools/compiler/ti-cgt-arm18.12.0.LTS/include/" --includepath="C:/ti/ccsv8/ccsbase/arm/include/" --includepath="C:/ti/ccsv8/ccsbase/arm/include/CMSIS" --includepath="C:/ti/workspace/RTOSDemo" --define=MSP432P401R --define=USECMSISREGISTERFORMAT=1 --define=TARGETISMSP432P4XX --define=ccs -g --gcc --diagwarning=225 --diagwrap=off --displayerrornumber --verbosediagnostics --genfuncsubsections=on --abi=eabi --preprocwithcompile --preprocdependency="FullDemo/serial.draw" --objdirectory="FullDemo" "../FullDemo/serial.c" Finished building: "../Full_Demo/serial.c"

Building file: "C:/FREERTOS/FreeRTOSv10.1.1/FreeRTOS/Demo/Common/Minimal/EventGroupsDemo.c" Invoking: ARM Compiler "C:/ti/ccsv8/tools/compiler/ti-cgt-arm18.12.0.LTS/bin/armcl" -mv7M4 --codestate=16 --floatsupport=FPv4SPD16 -me -O0 --optforspeed=2 --includepath="C:/ti/ccsv8/ccsbase/arm/include" --includepath="C:/ti/workspace/RTOSDemo/FullDemo" --includepath="C:/ti/workspace/RTOSDemo/driverlib/inc" --includepath="C:/ti/workspace/RTOSDemo/driverlib" --includepath="C:/FREERTOS/FreeRTOSv10.1.1/FreeRTOS-Plus/Source/FreeRTOS-Plus-CLI" --includepath="C:/FREERTOS/FreeRTOSv10.1.1/FreeRTOS/Demo/Common/include" --includepath="C:/FREERTOS/FreeRTOSv10.1.1/FreeRTOS/Source/include" --includepath="C:/FREERTOS/FreeRTOSv10.1.1/FreeRTOS/Source/portable/CCS/ARMCM4F" --includepath="C:/ti/ccsv8/tools/compiler/ti-cgt-arm18.12.0.LTS/include" --includepath="C:/ti/ccsv8/tools/compiler/ti-cgt-arm18.12.0.LTS/include/" --includepath="C:/ti/ccsv8/ccsbase/arm/include/" --includepath="C:/ti/ccsv8/ccsbase/arm/include/CMSIS" --includepath="C:/ti/workspace/RTOSDemo" --define=MSP432P401R --define=USECMSISREGISTERFORMAT=1 --define=TARGETISMSP432P4XX --define=ccs -g --gcc --diagwarning=225 --diagwrap=off --displayerrornumber --verbosediagnostics --genfuncsubsections=on --abi=eabi --preprocwithcompile --preprocdependency="FullDemo/StandardDemoTasks/EventGroupsDemo.draw" --objdirectory="FullDemo/StandardDemoTasks" "C:/FREERTOS/FreeRTOSv10.1.1/FreeRTOS/Demo/Common/Minimal/EventGroupsDemo.c" Finished building: "C:/FREERTOS/FreeRTOSv10.1.1/FreeRTOS/Demo/Common/Minimal/EventGroupsDemo.c"

Building file: "C:/FREERTOS/FreeRTOSv10.1.1/FreeRTOS/Demo/Common/Minimal/GenQTest.c" Invoking: ARM Compiler "C:/ti/ccsv8/tools/compiler/ti-cgt-arm18.12.0.LTS/bin/armcl" -mv7M4 --codestate=16 --floatsupport=FPv4SPD16 -me -O0 --optforspeed=2 --includepath="C:/ti/ccsv8/ccsbase/arm/include" --includepath="C:/ti/workspace/RTOSDemo/FullDemo" --includepath="C:/ti/workspace/RTOSDemo/driverlib/inc" --includepath="C:/ti/workspace/RTOSDemo/driverlib" --includepath="C:/FREERTOS/FreeRTOSv10.1.1/FreeRTOS-Plus/Source/FreeRTOS-Plus-CLI" --includepath="C:/FREERTOS/FreeRTOSv10.1.1/FreeRTOS/Demo/Common/include" --includepath="C:/FREERTOS/FreeRTOSv10.1.1/FreeRTOS/Source/include" --includepath="C:/FREERTOS/FreeRTOSv10.1.1/FreeRTOS/Source/portable/CCS/ARMCM4F" --includepath="C:/ti/ccsv8/tools/compiler/ti-cgt-arm18.12.0.LTS/include" --includepath="C:/ti/ccsv8/tools/compiler/ti-cgt-arm18.12.0.LTS/include/" --includepath="C:/ti/ccsv8/ccsbase/arm/include/" --includepath="C:/ti/ccsv8/ccsbase/arm/include/CMSIS" --includepath="C:/ti/workspace/RTOSDemo" --define=MSP432P401R --define=USECMSISREGISTERFORMAT=1 --define=TARGETISMSP432P4XX --define=ccs -g --gcc --diagwarning=225 --diagwrap=off --displayerrornumber --verbosediagnostics --genfuncsubsections=on --abi=eabi --preprocwithcompile --preprocdependency="FullDemo/StandardDemoTasks/GenQTest.draw" --objdirectory="FullDemo/StandardDemoTasks" "C:/FREERTOS/FreeRTOSv10.1.1/FreeRTOS/Demo/Common/Minimal/GenQTest.c" Finished building: "C:/FREERTOS/FreeRTOSv10.1.1/FreeRTOS/Demo/Common/Minimal/GenQTest.c"

Building file: "C:/FREERTOS/FreeRTOSv10.1.1/FreeRTOS/Demo/Common/Minimal/IntQueue.c" Invoking: ARM Compiler "C:/ti/ccsv8/tools/compiler/ti-cgt-arm18.12.0.LTS/bin/armcl" -mv7M4 --codestate=16 --floatsupport=FPv4SPD16 -me -O0 --optforspeed=2 --includepath="C:/ti/ccsv8/ccsbase/arm/include" --includepath="C:/ti/workspace/RTOSDemo/FullDemo" --includepath="C:/ti/workspace/RTOSDemo/driverlib/inc" --includepath="C:/ti/workspace/RTOSDemo/driverlib" --includepath="C:/FREERTOS/FreeRTOSv10.1.1/FreeRTOS-Plus/Source/FreeRTOS-Plus-CLI" --includepath="C:/FREERTOS/FreeRTOSv10.1.1/FreeRTOS/Demo/Common/include" --includepath="C:/FREERTOS/FreeRTOSv10.1.1/FreeRTOS/Source/include" --includepath="C:/FREERTOS/FreeRTOSv10.1.1/FreeRTOS/Source/portable/CCS/ARMCM4F" --includepath="C:/ti/ccsv8/tools/compiler/ti-cgt-arm18.12.0.LTS/include" --includepath="C:/ti/ccsv8/tools/compiler/ti-cgt-arm18.12.0.LTS/include/" --includepath="C:/ti/ccsv8/ccsbase/arm/include/" --includepath="C:/ti/ccsv8/ccsbase/arm/include/CMSIS" --includepath="C:/ti/workspace/RTOSDemo" --define=MSP432P401R --define=USECMSISREGISTERFORMAT=1 --define=TARGETISMSP432P4XX --define=ccs -g --gcc --diagwarning=225 --diagwrap=off --displayerrornumber --verbosediagnostics --genfuncsubsections=on --abi=eabi --preprocwithcompile --preprocdependency="FullDemo/StandardDemoTasks/IntQueue.draw" --objdirectory="FullDemo/StandardDemoTasks" "C:/FREERTOS/FreeRTOSv10.1.1/FreeRTOS/Demo/Common/Minimal/IntQueue.c" Finished building: "C:/FREERTOS/FreeRTOSv10.1.1/FreeRTOS/Demo/Common/Minimal/IntQueue.c"

Building file: "C:/FREERTOS/FreeRTOSv10.1.1/FreeRTOS/Demo/Common/Minimal/IntSemTest.c" Invoking: ARM Compiler "C:/ti/ccsv8/tools/compiler/ti-cgt-arm18.12.0.LTS/bin/armcl" -mv7M4 --codestate=16 --floatsupport=FPv4SPD16 -me -O0 --optforspeed=2 --includepath="C:/ti/ccsv8/ccsbase/arm/include" --includepath="C:/ti/workspace/RTOSDemo/FullDemo" --includepath="C:/ti/workspace/RTOSDemo/driverlib/inc" --includepath="C:/ti/workspace/RTOSDemo/driverlib" --includepath="C:/FREERTOS/FreeRTOSv10.1.1/FreeRTOS-Plus/Source/FreeRTOS-Plus-CLI" --includepath="C:/FREERTOS/FreeRTOSv10.1.1/FreeRTOS/Demo/Common/include" --includepath="C:/FREERTOS/FreeRTOSv10.1.1/FreeRTOS/Source/include" --includepath="C:/FREERTOS/FreeRTOSv10.1.1/FreeRTOS/Source/portable/CCS/ARMCM4F" --includepath="C:/ti/ccsv8/tools/compiler/ti-cgt-arm18.12.0.LTS/include" --includepath="C:/ti/ccsv8/tools/compiler/ti-cgt-arm18.12.0.LTS/include/" --includepath="C:/ti/ccsv8/ccsbase/arm/include/" --includepath="C:/ti/ccsv8/ccsbase/arm/include/CMSIS" --includepath="C:/ti/workspace/RTOSDemo" --define=MSP432P401R --define=USECMSISREGISTERFORMAT=1 --define=TARGETISMSP432P4XX --define=ccs -g --gcc --diagwarning=225 --diagwrap=off --displayerrornumber --verbosediagnostics --genfuncsubsections=on --abi=eabi --preprocwithcompile --preprocdependency="FullDemo/StandardDemoTasks/IntSemTest.draw" --objdirectory="FullDemo/StandardDemoTasks" "C:/FREERTOS/FreeRTOSv10.1.1/FreeRTOS/Demo/Common/Minimal/IntSemTest.c" Finished building: "C:/FREERTOS/FreeRTOSv10.1.1/FreeRTOS/Demo/Common/Minimal/IntSemTest.c"

Building file: "C:/FREERTOS/FreeRTOSv10.1.1/FreeRTOS/Demo/Common/Minimal/TaskNotify.c" Invoking: ARM Compiler "C:/ti/ccsv8/tools/compiler/ti-cgt-arm18.12.0.LTS/bin/armcl" -mv7M4 --codestate=16 --floatsupport=FPv4SPD16 -me -O0 --optforspeed=2 --includepath="C:/ti/ccsv8/ccsbase/arm/include" --includepath="C:/ti/workspace/RTOSDemo/FullDemo" --includepath="C:/ti/workspace/RTOSDemo/driverlib/inc" --includepath="C:/ti/workspace/RTOSDemo/driverlib" --includepath="C:/FREERTOS/FreeRTOSv10.1.1/FreeRTOS-Plus/Source/FreeRTOS-Plus-CLI" --includepath="C:/FREERTOS/FreeRTOSv10.1.1/FreeRTOS/Demo/Common/include" --includepath="C:/FREERTOS/FreeRTOSv10.1.1/FreeRTOS/Source/include" --includepath="C:/FREERTOS/FreeRTOSv10.1.1/FreeRTOS/Source/portable/CCS/ARMCM4F" --includepath="C:/ti/ccsv8/tools/compiler/ti-cgt-arm18.12.0.LTS/include" --includepath="C:/ti/ccsv8/tools/compiler/ti-cgt-arm18.12.0.LTS/include/" --includepath="C:/ti/ccsv8/ccsbase/arm/include/" --includepath="C:/ti/ccsv8/ccsbase/arm/include/CMSIS" --includepath="C:/ti/workspace/RTOSDemo" --define=MSP432P401R --define=USECMSISREGISTERFORMAT=1 --define=TARGETISMSP432P4XX --define=ccs -g --gcc --diagwarning=225 --diagwrap=off --displayerrornumber --verbosediagnostics --genfuncsubsections=on --abi=eabi --preprocwithcompile --preprocdependency="FullDemo/StandardDemoTasks/TaskNotify.draw" --objdirectory="FullDemo/StandardDemoTasks" "C:/FREERTOS/FreeRTOSv10.1.1/FreeRTOS/Demo/Common/Minimal/TaskNotify.c" Finished building: "C:/FREERTOS/FreeRTOSv10.1.1/FreeRTOS/Demo/Common/Minimal/TaskNotify.c"

Building file: "C:/FREERTOS/FreeRTOSv10.1.1/FreeRTOS/Demo/Common/Minimal/TimerDemo.c" Invoking: ARM Compiler "C:/ti/ccsv8/tools/compiler/ti-cgt-arm18.12.0.LTS/bin/armcl" -mv7M4 --codestate=16 --floatsupport=FPv4SPD16 -me -O0 --optforspeed=2 --includepath="C:/ti/ccsv8/ccsbase/arm/include" --includepath="C:/ti/workspace/RTOSDemo/FullDemo" --includepath="C:/ti/workspace/RTOSDemo/driverlib/inc" --includepath="C:/ti/workspace/RTOSDemo/driverlib" --includepath="C:/FREERTOS/FreeRTOSv10.1.1/FreeRTOS-Plus/Source/FreeRTOS-Plus-CLI" --includepath="C:/FREERTOS/FreeRTOSv10.1.1/FreeRTOS/Demo/Common/include" --includepath="C:/FREERTOS/FreeRTOSv10.1.1/FreeRTOS/Source/include" --includepath="C:/FREERTOS/FreeRTOSv10.1.1/FreeRTOS/Source/portable/CCS/ARMCM4F" --includepath="C:/ti/ccsv8/tools/compiler/ti-cgt-arm18.12.0.LTS/include" --includepath="C:/ti/ccsv8/tools/compiler/ti-cgt-arm18.12.0.LTS/include/" --includepath="C:/ti/ccsv8/ccsbase/arm/include/" --includepath="C:/ti/ccsv8/ccsbase/arm/include/CMSIS" --includepath="C:/ti/workspace/RTOSDemo" --define=MSP432P401R --define=USECMSISREGISTERFORMAT=1 --define=TARGETISMSP432P4XX --define=ccs -g --gcc --diagwarning=225 --diagwrap=off --displayerrornumber --verbosediagnostics --genfuncsubsections=on --abi=eabi --preprocwithcompile --preprocdependency="FullDemo/StandardDemoTasks/TimerDemo.draw" --objdirectory="FullDemo/StandardDemoTasks" "C:/FREERTOS/FreeRTOSv10.1.1/FreeRTOS/Demo/Common/Minimal/TimerDemo.c" Finished building: "C:/FREERTOS/FreeRTOSv10.1.1/FreeRTOS/Demo/Common/Minimal/TimerDemo.c"

Building file: "C:/FREERTOS/FreeRTOSv10.1.1/FreeRTOS/Demo/Common/Minimal/countsem.c" Invoking: ARM Compiler "C:/ti/ccsv8/tools/compiler/ti-cgt-arm18.12.0.LTS/bin/armcl" -mv7M4 --codestate=16 --floatsupport=FPv4SPD16 -me -O0 --optforspeed=2 --includepath="C:/ti/ccsv8/ccsbase/arm/include" --includepath="C:/ti/workspace/RTOSDemo/FullDemo" --includepath="C:/ti/workspace/RTOSDemo/driverlib/inc" --includepath="C:/ti/workspace/RTOSDemo/driverlib" --includepath="C:/FREERTOS/FreeRTOSv10.1.1/FreeRTOS-Plus/Source/FreeRTOS-Plus-CLI" --includepath="C:/FREERTOS/FreeRTOSv10.1.1/FreeRTOS/Demo/Common/include" --includepath="C:/FREERTOS/FreeRTOSv10.1.1/FreeRTOS/Source/include" --includepath="C:/FREERTOS/FreeRTOSv10.1.1/FreeRTOS/Source/portable/CCS/ARMCM4F" --includepath="C:/ti/ccsv8/tools/compiler/ti-cgt-arm18.12.0.LTS/include" --includepath="C:/ti/ccsv8/tools/compiler/ti-cgt-arm18.12.0.LTS/include/" --includepath="C:/ti/ccsv8/ccsbase/arm/include/" --includepath="C:/ti/ccsv8/ccsbase/arm/include/CMSIS" --includepath="C:/ti/workspace/RTOSDemo" --define=MSP432P401R --define=USECMSISREGISTERFORMAT=1 --define=TARGETISMSP432P4XX --define=ccs -g --gcc --diagwarning=225 --diagwrap=off --displayerrornumber --verbosediagnostics --genfuncsubsections=on --abi=eabi --preprocwithcompile --preprocdependency="FullDemo/StandardDemoTasks/countsem.draw" --objdirectory="FullDemo/StandardDemoTasks" "C:/FREERTOS/FreeRTOSv10.1.1/FreeRTOS/Demo/Common/Minimal/countsem.c" Finished building: "C:/FREERTOS/FreeRTOSv10.1.1/FreeRTOS/Demo/Common/Minimal/countsem.c"

Building file: "C:/FREERTOS/FreeRTOSv10.1.1/FreeRTOS/Demo/Common/Minimal/recmutex.c" Invoking: ARM Compiler "C:/ti/ccsv8/tools/compiler/ti-cgt-arm18.12.0.LTS/bin/armcl" -mv7M4 --codestate=16 --floatsupport=FPv4SPD16 -me -O0 --optforspeed=2 --includepath="C:/ti/ccsv8/ccsbase/arm/include" --includepath="C:/ti/workspace/RTOSDemo/FullDemo" --includepath="C:/ti/workspace/RTOSDemo/driverlib/inc" --includepath="C:/ti/workspace/RTOSDemo/driverlib" --includepath="C:/FREERTOS/FreeRTOSv10.1.1/FreeRTOS-Plus/Source/FreeRTOS-Plus-CLI" --includepath="C:/FREERTOS/FreeRTOSv10.1.1/FreeRTOS/Demo/Common/include" --includepath="C:/FREERTOS/FreeRTOSv10.1.1/FreeRTOS/Source/include" --includepath="C:/FREERTOS/FreeRTOSv10.1.1/FreeRTOS/Source/portable/CCS/ARMCM4F" --includepath="C:/ti/ccsv8/tools/compiler/ti-cgt-arm18.12.0.LTS/include" --includepath="C:/ti/ccsv8/tools/compiler/ti-cgt-arm18.12.0.LTS/include/" --includepath="C:/ti/ccsv8/ccsbase/arm/include/" --includepath="C:/ti/ccsv8/ccsbase/arm/include/CMSIS" --includepath="C:/ti/workspace/RTOSDemo" --define=MSP432P401R --define=USECMSISREGISTERFORMAT=1 --define=TARGETISMSP432P4XX --define=ccs -g --gcc --diagwarning=225 --diagwrap=off --displayerrornumber --verbosediagnostics --genfuncsubsections=on --abi=eabi --preprocwithcompile --preprocdependency="FullDemo/StandardDemoTasks/recmutex.draw" --objdirectory="FullDemo/StandardDemoTasks" "C:/FREERTOS/FreeRTOSv10.1.1/FreeRTOS/Demo/Common/Minimal/recmutex.c" Finished building: "C:/FREERTOS/FreeRTOSv10.1.1/FreeRTOS/Demo/Common/Minimal/recmutex.c"

Building file: "C:/FREERTOS/FreeRTOSv10.1.1/FreeRTOS/Demo/Common/Minimal/semtest.c" Invoking: ARM Compiler "C:/ti/ccsv8/tools/compiler/ti-cgt-arm18.12.0.LTS/bin/armcl" -mv7M4 --codestate=16 --floatsupport=FPv4SPD16 -me -O0 --optforspeed=2 --includepath="C:/ti/ccsv8/ccsbase/arm/include" --includepath="C:/ti/workspace/RTOSDemo/FullDemo" --includepath="C:/ti/workspace/RTOSDemo/driverlib/inc" --includepath="C:/ti/workspace/RTOSDemo/driverlib" --includepath="C:/FREERTOS/FreeRTOSv10.1.1/FreeRTOS-Plus/Source/FreeRTOS-Plus-CLI" --includepath="C:/FREERTOS/FreeRTOSv10.1.1/FreeRTOS/Demo/Common/include" --includepath="C:/FREERTOS/FreeRTOSv10.1.1/FreeRTOS/Source/include" --includepath="C:/FREERTOS/FreeRTOSv10.1.1/FreeRTOS/Source/portable/CCS/ARMCM4F" --includepath="C:/ti/ccsv8/tools/compiler/ti-cgt-arm18.12.0.LTS/include" --includepath="C:/ti/ccsv8/tools/compiler/ti-cgt-arm18.12.0.LTS/include/" --includepath="C:/ti/ccsv8/ccsbase/arm/include/" --includepath="C:/ti/ccsv8/ccsbase/arm/include/CMSIS" --includepath="C:/ti/workspace/RTOSDemo" --define=MSP432P401R --define=USECMSISREGISTERFORMAT=1 --define=TARGETISMSP432P4XX --define=ccs -g --gcc --diagwarning=225 --diagwrap=off --displayerrornumber --verbosediagnostics --genfuncsubsections=on --abi=eabi --preprocwithcompile --preprocdependency="FullDemo/StandardDemoTasks/semtest.draw" --objdirectory="FullDemo/StandardDemoTasks" "C:/FREERTOS/FreeRTOSv10.1.1/FreeRTOS/Demo/Common/Minimal/semtest.c" Finished building: "C:/FREERTOS/FreeRTOSv10.1.1/FreeRTOS/Demo/Common/Minimal/semtest.c"

Building file: "C:/FREERTOS/FreeRTOSv10.1.1/FreeRTOS/Demo/Common/Minimal/spflop.c" Invoking: ARM Compiler "C:/ti/ccsv8/tools/compiler/ti-cgt-arm18.12.0.LTS/bin/armcl" -mv7M4 --codestate=16 --floatsupport=FPv4SPD16 -me -O0 --optforspeed=2 --includepath="C:/ti/ccsv8/ccsbase/arm/include" --includepath="C:/ti/workspace/RTOSDemo/FullDemo" --includepath="C:/ti/workspace/RTOSDemo/driverlib/inc" --includepath="C:/ti/workspace/RTOSDemo/driverlib" --includepath="C:/FREERTOS/FreeRTOSv10.1.1/FreeRTOS-Plus/Source/FreeRTOS-Plus-CLI" --includepath="C:/FREERTOS/FreeRTOSv10.1.1/FreeRTOS/Demo/Common/include" --includepath="C:/FREERTOS/FreeRTOSv10.1.1/FreeRTOS/Source/include" --includepath="C:/FREERTOS/FreeRTOSv10.1.1/FreeRTOS/Source/portable/CCS/ARMCM4F" --includepath="C:/ti/ccsv8/tools/compiler/ti-cgt-arm18.12.0.LTS/include" --includepath="C:/ti/ccsv8/tools/compiler/ti-cgt-arm18.12.0.LTS/include/" --includepath="C:/ti/ccsv8/ccsbase/arm/include/" --includepath="C:/ti/ccsv8/ccsbase/arm/include/CMSIS" --includepath="C:/ti/workspace/RTOSDemo" --define=MSP432P401R --define=USECMSISREGISTERFORMAT=1 --define=TARGETISMSP432P4XX --define=ccs -g --gcc --diagwarning=225 --diagwrap=off --displayerrornumber --verbosediagnostics --genfuncsubsections=on --abi=eabi --preprocwithcompile --preprocdependency="FullDemo/StandardDemoTasks/spflop.draw" --objdirectory="FullDemo/StandardDemoTasks" "C:/FREERTOS/FreeRTOSv10.1.1/FreeRTOS/Demo/Common/Minimal/spflop.c" Finished building: "C:/FREERTOS/FreeRTOSv10.1.1/FreeRTOS/Demo/Common/Minimal/spflop.c"

Building file: "../SimplyBlinkyDemo/mainblinky.c" Invoking: ARM Compiler "C:/ti/ccsv8/tools/compiler/ti-cgt-arm18.12.0.LTS/bin/armcl" -mv7M4 --codestate=16 --floatsupport=FPv4SPD16 -me -O0 --optforspeed=2 --includepath="C:/ti/ccsv8/ccsbase/arm/include" --includepath="C:/ti/workspace/RTOSDemo/FullDemo" --includepath="C:/ti/workspace/RTOSDemo/driverlib/inc" --includepath="C:/ti/workspace/RTOSDemo/driverlib" --includepath="C:/FREERTOS/FreeRTOSv10.1.1/FreeRTOS-Plus/Source/FreeRTOS-Plus-CLI" --includepath="C:/FREERTOS/FreeRTOSv10.1.1/FreeRTOS/Demo/Common/include" --includepath="C:/FREERTOS/FreeRTOSv10.1.1/FreeRTOS/Source/include" --includepath="C:/FREERTOS/FreeRTOSv10.1.1/FreeRTOS/Source/portable/CCS/ARMCM4F" --includepath="C:/ti/ccsv8/tools/compiler/ti-cgt-arm18.12.0.LTS/include" --includepath="C:/ti/ccsv8/tools/compiler/ti-cgt-arm18.12.0.LTS/include/" --includepath="C:/ti/ccsv8/ccsbase/arm/include/" --includepath="C:/ti/ccsv8/ccsbase/arm/include/CMSIS" --includepath="C:/ti/workspace/RTOSDemo" --define=MSP432P401R --define=USECMSISREGISTERFORMAT=1 --define=TARGETISMSP432P4XX --define=ccs -g --gcc --diagwarning=225 --diagwrap=off --displayerrornumber --verbosediagnostics --genfuncsubsections=on --abi=eabi --preprocwithcompile --preprocdependency="SimplyBlinkyDemo/mainblinky.draw" --objdirectory="SimplyBlinkyDemo" "../SimplyBlinkyDemo/mainblinky.c" Finished building: "../SimplyBlinkyDemo/mainblinky.c"

Building file: "../driverlib/cpu.c" Invoking: ARM Compiler "C:/ti/ccsv8/tools/compiler/ti-cgt-arm18.12.0.LTS/bin/armcl" -mv7M4 --codestate=16 --floatsupport=FPv4SPD16 -me -O0 --optforspeed=2 --includepath="C:/ti/ccsv8/ccsbase/arm/include" --includepath="C:/ti/workspace/RTOSDemo/FullDemo" --includepath="C:/ti/workspace/RTOSDemo/driverlib/inc" --includepath="C:/ti/workspace/RTOSDemo/driverlib" --includepath="C:/FREERTOS/FreeRTOSv10.1.1/FreeRTOS-Plus/Source/FreeRTOS-Plus-CLI" --includepath="C:/FREERTOS/FreeRTOSv10.1.1/FreeRTOS/Demo/Common/include" --includepath="C:/FREERTOS/FreeRTOSv10.1.1/FreeRTOS/Source/include" --includepath="C:/FREERTOS/FreeRTOSv10.1.1/FreeRTOS/Source/portable/CCS/ARMCM4F" --includepath="C:/ti/ccsv8/tools/compiler/ti-cgt-arm18.12.0.LTS/include" --includepath="C:/ti/ccsv8/tools/compiler/ti-cgt-arm18.12.0.LTS/include/" --includepath="C:/ti/ccsv8/ccsbase/arm/include/" --includepath="C:/ti/ccsv8/ccsbase/arm/include/CMSIS" --includepath="C:/ti/workspace/RTOSDemo" --define=MSP432P401R --define=USECMSISREGISTERFORMAT=1 --define=TARGETISMSP432P4XX --define=ccs -g --gcc --diagwarning=225 --diagwrap=off --displayerrornumber --verbosediagnostics --genfuncsubsections=on --abi=eabi --preprocwithcompile --preprocdependency="driverlib/cpu.draw" --objdirectory="driverlib" "../driverlib/cpu.c" Finished building: "../driverlib/cpu.c"

Building file: "../driverlib/cs.c" Invoking: ARM Compiler "C:/ti/ccsv8/tools/compiler/ti-cgt-arm18.12.0.LTS/bin/armcl" -mv7M4 --codestate=16 --floatsupport=FPv4SPD16 -me -O0 --optforspeed=2 --includepath="C:/ti/ccsv8/ccsbase/arm/include" --includepath="C:/ti/workspace/RTOSDemo/FullDemo" --includepath="C:/ti/workspace/RTOSDemo/driverlib/inc" --includepath="C:/ti/workspace/RTOSDemo/driverlib" --includepath="C:/FREERTOS/FreeRTOSv10.1.1/FreeRTOS-Plus/Source/FreeRTOS-Plus-CLI" --includepath="C:/FREERTOS/FreeRTOSv10.1.1/FreeRTOS/Demo/Common/include" --includepath="C:/FREERTOS/FreeRTOSv10.1.1/FreeRTOS/Source/include" --includepath="C:/FREERTOS/FreeRTOSv10.1.1/FreeRTOS/Source/portable/CCS/ARMCM4F" --includepath="C:/ti/ccsv8/tools/compiler/ti-cgt-arm18.12.0.LTS/include" --includepath="C:/ti/ccsv8/tools/compiler/ti-cgt-arm18.12.0.LTS/include/" --includepath="C:/ti/ccsv8/ccsbase/arm/include/" --includepath="C:/ti/ccsv8/ccsbase/arm/include/CMSIS" --includepath="C:/ti/workspace/RTOSDemo" --define=MSP432P401R --define=USECMSISREGISTERFORMAT=1 --define=TARGETISMSP432P4XX --define=ccs -g --gcc --diagwarning=225 --diagwrap=off --displayerrornumber --verbosediagnostics --genfuncsubsections=on --abi=eabi --preprocwithcompile --preprocdependency="driverlib/cs.draw" --objdirectory="driverlib" "../driverlib/cs.c" Finished building: "../driverlib/cs.c"

Building file: "../driverlib/flash.c" Invoking: ARM Compiler "C:/ti/ccsv8/tools/compiler/ti-cgt-arm18.12.0.LTS/bin/armcl" -mv7M4 --codestate=16 --floatsupport=FPv4SPD16 -me -O0 --optforspeed=2 --includepath="C:/ti/ccsv8/ccsbase/arm/include" --includepath="C:/ti/workspace/RTOSDemo/FullDemo" --includepath="C:/ti/workspace/RTOSDemo/driverlib/inc" --includepath="C:/ti/workspace/RTOSDemo/driverlib" --includepath="C:/FREERTOS/FreeRTOSv10.1.1/FreeRTOS-Plus/Source/FreeRTOS-Plus-CLI" --includepath="C:/FREERTOS/FreeRTOSv10.1.1/FreeRTOS/Demo/Common/include" --includepath="C:/FREERTOS/FreeRTOSv10.1.1/FreeRTOS/Source/include" --includepath="C:/FREERTOS/FreeRTOSv10.1.1/FreeRTOS/Source/portable/CCS/ARMCM4F" --includepath="C:/ti/ccsv8/tools/compiler/ti-cgt-arm18.12.0.LTS/include" --includepath="C:/ti/ccsv8/tools/compiler/ti-cgt-arm18.12.0.LTS/include/" --includepath="C:/ti/ccsv8/ccsbase/arm/include/" --includepath="C:/ti/ccsv8/ccsbase/arm/include/CMSIS" --includepath="C:/ti/workspace/RTOSDemo" --define=MSP432P401R --define=USECMSISREGISTERFORMAT=1 --define=TARGETISMSP432P4XX --define=ccs -g --gcc --diagwarning=225 --diagwrap=off --displayerrornumber --verbosediagnostics --genfuncsubsections=on --abi=eabi --preprocwithcompile --preprocdependency="driverlib/flash.draw" --objdirectory="driverlib" "../driverlib/flash.c" Finished building: "../driverlib/flash.c"

Building file: "../driverlib/fpu.c" Invoking: ARM Compiler "C:/ti/ccsv8/tools/compiler/ti-cgt-arm18.12.0.LTS/bin/armcl" -mv7M4 --codestate=16 --floatsupport=FPv4SPD16 -me -O0 --optforspeed=2 --includepath="C:/ti/ccsv8/ccsbase/arm/include" --includepath="C:/ti/workspace/RTOSDemo/FullDemo" --includepath="C:/ti/workspace/RTOSDemo/driverlib/inc" --includepath="C:/ti/workspace/RTOSDemo/driverlib" --includepath="C:/FREERTOS/FreeRTOSv10.1.1/FreeRTOS-Plus/Source/FreeRTOS-Plus-CLI" --includepath="C:/FREERTOS/FreeRTOSv10.1.1/FreeRTOS/Demo/Common/include" --includepath="C:/FREERTOS/FreeRTOSv10.1.1/FreeRTOS/Source/include" --includepath="C:/FREERTOS/FreeRTOSv10.1.1/FreeRTOS/Source/portable/CCS/ARMCM4F" --includepath="C:/ti/ccsv8/tools/compiler/ti-cgt-arm18.12.0.LTS/include" --includepath="C:/ti/ccsv8/tools/compiler/ti-cgt-arm18.12.0.LTS/include/" --includepath="C:/ti/ccsv8/ccsbase/arm/include/" --includepath="C:/ti/ccsv8/ccsbase/arm/include/CMSIS" --includepath="C:/ti/workspace/RTOSDemo" --define=MSP432P401R --define=USECMSISREGISTERFORMAT=1 --define=TARGETISMSP432P4XX --define=ccs -g --gcc --diagwarning=225 --diagwrap=off --displayerrornumber --verbosediagnostics --genfuncsubsections=on --abi=eabi --preprocwithcompile --preprocdependency="driverlib/fpu.draw" --objdirectory="driverlib" "../driverlib/fpu.c" Finished building: "../driverlib/fpu.c"

Building file: "../driverlib/gpio.c" Invoking: ARM Compiler "C:/ti/ccsv8/tools/compiler/ti-cgt-arm18.12.0.LTS/bin/armcl" -mv7M4 --codestate=16 --floatsupport=FPv4SPD16 -me -O0 --optforspeed=2 --includepath="C:/ti/ccsv8/ccsbase/arm/include" --includepath="C:/ti/workspace/RTOSDemo/FullDemo" --includepath="C:/ti/workspace/RTOSDemo/driverlib/inc" --includepath="C:/ti/workspace/RTOSDemo/driverlib" --includepath="C:/FREERTOS/FreeRTOSv10.1.1/FreeRTOS-Plus/Source/FreeRTOS-Plus-CLI" --includepath="C:/FREERTOS/FreeRTOSv10.1.1/FreeRTOS/Demo/Common/include" --includepath="C:/FREERTOS/FreeRTOSv10.1.1/FreeRTOS/Source/include" --includepath="C:/FREERTOS/FreeRTOSv10.1.1/FreeRTOS/Source/portable/CCS/ARMCM4F" --includepath="C:/ti/ccsv8/tools/compiler/ti-cgt-arm18.12.0.LTS/include" --includepath="C:/ti/ccsv8/tools/compiler/ti-cgt-arm18.12.0.LTS/include/" --includepath="C:/ti/ccsv8/ccsbase/arm/include/" --includepath="C:/ti/ccsv8/ccsbase/arm/include/CMSIS" --includepath="C:/ti/workspace/RTOSDemo" --define=MSP432P401R --define=USECMSISREGISTERFORMAT=1 --define=TARGETISMSP432P4XX --define=ccs -g --gcc --diagwarning=225 --diagwrap=off --displayerrornumber --verbosediagnostics --genfuncsubsections=on --abi=eabi --preprocwithcompile --preprocdependency="driverlib/gpio.draw" --objdirectory="driverlib" "../driverlib/gpio.c" Finished building: "../driverlib/gpio.c"

Building file: "../driverlib/interrupt.c" Invoking: ARM Compiler "C:/ti/ccsv8/tools/compiler/ti-cgt-arm18.12.0.LTS/bin/armcl" -mv7M4 --codestate=16 --floatsupport=FPv4SPD16 -me -O0 --optforspeed=2 --includepath="C:/ti/ccsv8/ccsbase/arm/include" --includepath="C:/ti/workspace/RTOSDemo/FullDemo" --includepath="C:/ti/workspace/RTOSDemo/driverlib/inc" --includepath="C:/ti/workspace/RTOSDemo/driverlib" --includepath="C:/FREERTOS/FreeRTOSv10.1.1/FreeRTOS-Plus/Source/FreeRTOS-Plus-CLI" --includepath="C:/FREERTOS/FreeRTOSv10.1.1/FreeRTOS/Demo/Common/include" --includepath="C:/FREERTOS/FreeRTOSv10.1.1/FreeRTOS/Source/include" --includepath="C:/FREERTOS/FreeRTOSv10.1.1/FreeRTOS/Source/portable/CCS/ARMCM4F" --includepath="C:/ti/ccsv8/tools/compiler/ti-cgt-arm18.12.0.LTS/include" --includepath="C:/ti/ccsv8/tools/compiler/ti-cgt-arm18.12.0.LTS/include/" --includepath="C:/ti/ccsv8/ccsbase/arm/include/" --includepath="C:/ti/ccsv8/ccsbase/arm/include/CMSIS" --includepath="C:/ti/workspace/RTOSDemo" --define=MSP432P401R --define=USECMSISREGISTERFORMAT=1 --define=TARGETISMSP432P4XX --define=ccs -g --gcc --diagwarning=225 --diagwrap=off --displayerrornumber --verbosediagnostics --genfuncsubsections=on --abi=eabi --preprocwithcompile --preprocdependency="driverlib/interrupt.draw" --objdirectory="driverlib" "../driverlib/interrupt.c" Finished building: "../driverlib/interrupt.c"

Building file: "../driverlib/pcm.c" Invoking: ARM Compiler "C:/ti/ccsv8/tools/compiler/ti-cgt-arm18.12.0.LTS/bin/armcl" -mv7M4 --codestate=16 --floatsupport=FPv4SPD16 -me -O0 --optforspeed=2 --includepath="C:/ti/ccsv8/ccsbase/arm/include" --includepath="C:/ti/workspace/RTOSDemo/FullDemo" --includepath="C:/ti/workspace/RTOSDemo/driverlib/inc" --includepath="C:/ti/workspace/RTOSDemo/driverlib" --includepath="C:/FREERTOS/FreeRTOSv10.1.1/FreeRTOS-Plus/Source/FreeRTOS-Plus-CLI" --includepath="C:/FREERTOS/FreeRTOSv10.1.1/FreeRTOS/Demo/Common/include" --includepath="C:/FREERTOS/FreeRTOSv10.1.1/FreeRTOS/Source/include" --includepath="C:/FREERTOS/FreeRTOSv10.1.1/FreeRTOS/Source/portable/CCS/ARMCM4F" --includepath="C:/ti/ccsv8/tools/compiler/ti-cgt-arm18.12.0.LTS/include" --includepath="C:/ti/ccsv8/tools/compiler/ti-cgt-arm18.12.0.LTS/include/" --includepath="C:/ti/ccsv8/ccsbase/arm/include/" --includepath="C:/ti/ccsv8/ccsbase/arm/include/CMSIS" --includepath="C:/ti/workspace/RTOSDemo" --define=MSP432P401R --define=USECMSISREGISTERFORMAT=1 --define=TARGETISMSP432P4XX --define=ccs -g --gcc --diagwarning=225 --diagwrap=off --displayerrornumber --verbosediagnostics --genfuncsubsections=on --abi=eabi --preprocwithcompile --preprocdependency="driverlib/pcm.draw" --objdirectory="driverlib" "../driverlib/pcm.c" Finished building: "../driverlib/pcm.c"

Building file: "../driverlib/sysctl.c" Invoking: ARM Compiler "C:/ti/ccsv8/tools/compiler/ti-cgt-arm18.12.0.LTS/bin/armcl" -mv7M4 --codestate=16 --floatsupport=FPv4SPD16 -me -O0 --optforspeed=2 --includepath="C:/ti/ccsv8/ccsbase/arm/include" --includepath="C:/ti/workspace/RTOSDemo/FullDemo" --includepath="C:/ti/workspace/RTOSDemo/driverlib/inc" --includepath="C:/ti/workspace/RTOSDemo/driverlib" --includepath="C:/FREERTOS/FreeRTOSv10.1.1/FreeRTOS-Plus/Source/FreeRTOS-Plus-CLI" --includepath="C:/FREERTOS/FreeRTOSv10.1.1/FreeRTOS/Demo/Common/include" --includepath="C:/FREERTOS/FreeRTOSv10.1.1/FreeRTOS/Source/include" --includepath="C:/FREERTOS/FreeRTOSv10.1.1/FreeRTOS/Source/portable/CCS/ARMCM4F" --includepath="C:/ti/ccsv8/tools/compiler/ti-cgt-arm18.12.0.LTS/include" --includepath="C:/ti/ccsv8/tools/compiler/ti-cgt-arm18.12.0.LTS/include/" --includepath="C:/ti/ccsv8/ccsbase/arm/include/" --includepath="C:/ti/ccsv8/ccsbase/arm/include/CMSIS" --includepath="C:/ti/workspace/RTOSDemo" --define=MSP432P401R --define=USECMSISREGISTERFORMAT=1 --define=TARGETISMSP432P4XX --define=ccs -g --gcc --diagwarning=225 --diagwrap=off --displayerrornumber --verbosediagnostics --genfuncsubsections=on --abi=eabi --preprocwithcompile --preprocdependency="driverlib/sysctl.draw" --objdirectory="driverlib" "../driverlib/sysctl.c" Finished building: "../driverlib/sysctl.c"

Building file: "../driverlib/timer32.c" Invoking: ARM Compiler "C:/ti/ccsv8/tools/compiler/ti-cgt-arm18.12.0.LTS/bin/armcl" -mv7M4 --codestate=16 --floatsupport=FPv4SPD16 -me -O0 --optforspeed=2 --includepath="C:/ti/ccsv8/ccsbase/arm/include" --includepath="C:/ti/workspace/RTOSDemo/FullDemo" --includepath="C:/ti/workspace/RTOSDemo/driverlib/inc" --includepath="C:/ti/workspace/RTOSDemo/driverlib" --includepath="C:/FREERTOS/FreeRTOSv10.1.1/FreeRTOS-Plus/Source/FreeRTOS-Plus-CLI" --includepath="C:/FREERTOS/FreeRTOSv10.1.1/FreeRTOS/Demo/Common/include" --includepath="C:/FREERTOS/FreeRTOSv10.1.1/FreeRTOS/Source/include" --includepath="C:/FREERTOS/FreeRTOSv10.1.1/FreeRTOS/Source/portable/CCS/ARMCM4F" --includepath="C:/ti/ccsv8/tools/compiler/ti-cgt-arm18.12.0.LTS/include" --includepath="C:/ti/ccsv8/tools/compiler/ti-cgt-arm18.12.0.LTS/include/" --includepath="C:/ti/ccsv8/ccsbase/arm/include/" --includepath="C:/ti/ccsv8/ccsbase/arm/include/CMSIS" --includepath="C:/ti/workspace/RTOSDemo" --define=MSP432P401R --define=USECMSISREGISTERFORMAT=1 --define=TARGETISMSP432P4XX --define=ccs -g --gcc --diagwarning=225 --diagwrap=off --displayerrornumber --verbosediagnostics --genfuncsubsections=on --abi=eabi --preprocwithcompile --preprocdependency="driverlib/timer32.draw" --objdirectory="driverlib" "../driverlib/timer32.c" Finished building: "../driverlib/timer32.c"

Building file: "../driverlib/uart.c" Invoking: ARM Compiler "C:/ti/ccsv8/tools/compiler/ti-cgt-arm18.12.0.LTS/bin/armcl" -mv7M4 --codestate=16 --floatsupport=FPv4SPD16 -me -O0 --optforspeed=2 --includepath="C:/ti/ccsv8/ccsbase/arm/include" --includepath="C:/ti/workspace/RTOSDemo/FullDemo" --includepath="C:/ti/workspace/RTOSDemo/driverlib/inc" --includepath="C:/ti/workspace/RTOSDemo/driverlib" --includepath="C:/FREERTOS/FreeRTOSv10.1.1/FreeRTOS-Plus/Source/FreeRTOS-Plus-CLI" --includepath="C:/FREERTOS/FreeRTOSv10.1.1/FreeRTOS/Demo/Common/include" --includepath="C:/FREERTOS/FreeRTOSv10.1.1/FreeRTOS/Source/include" --includepath="C:/FREERTOS/FreeRTOSv10.1.1/FreeRTOS/Source/portable/CCS/ARMCM4F" --includepath="C:/ti/ccsv8/tools/compiler/ti-cgt-arm18.12.0.LTS/include" --includepath="C:/ti/ccsv8/tools/compiler/ti-cgt-arm18.12.0.LTS/include/" --includepath="C:/ti/ccsv8/ccsbase/arm/include/" --includepath="C:/ti/ccsv8/ccsbase/arm/include/CMSIS" --includepath="C:/ti/workspace/RTOSDemo" --define=MSP432P401R --define=USECMSISREGISTERFORMAT=1 --define=TARGETISMSP432P4XX --define=ccs -g --gcc --diagwarning=225 --diagwrap=off --displayerrornumber --verbosediagnostics --genfuncsubsections=on --abi=eabi --preprocwithcompile --preprocdependency="driverlib/uart.draw" --objdirectory="driverlib" "../driverlib/uart.c" Finished building: "../driverlib/uart.c"

Building file: "../driverlib/wdta.c" Invoking: ARM Compiler "C:/ti/ccsv8/tools/compiler/ti-cgt-arm18.12.0.LTS/bin/armcl" -mv7M4 --codestate=16 --floatsupport=FPv4SPD16 -me -O0 --optforspeed=2 --includepath="C:/ti/ccsv8/ccsbase/arm/include" --includepath="C:/ti/workspace/RTOSDemo/FullDemo" --includepath="C:/ti/workspace/RTOSDemo/driverlib/inc" --includepath="C:/ti/workspace/RTOSDemo/driverlib" --includepath="C:/FREERTOS/FreeRTOSv10.1.1/FreeRTOS-Plus/Source/FreeRTOS-Plus-CLI" --includepath="C:/FREERTOS/FreeRTOSv10.1.1/FreeRTOS/Demo/Common/include" --includepath="C:/FREERTOS/FreeRTOSv10.1.1/FreeRTOS/Source/include" --includepath="C:/FREERTOS/FreeRTOSv10.1.1/FreeRTOS/Source/portable/CCS/ARMCM4F" --includepath="C:/ti/ccsv8/tools/compiler/ti-cgt-arm18.12.0.LTS/include" --includepath="C:/ti/ccsv8/tools/compiler/ti-cgt-arm18.12.0.LTS/include/" --includepath="C:/ti/ccsv8/ccsbase/arm/include/" --includepath="C:/ti/ccsv8/ccsbase/arm/include/CMSIS" --includepath="C:/ti/workspace/RTOSDemo" --define=MSP432P401R --define=USECMSISREGISTERFORMAT=1 --define=TARGETISMSP432P4XX --define=ccs -g --gcc --diagwarning=225 --diagwrap=off --displayerrornumber --verbosediagnostics --genfuncsubsections=on --abi=eabi --preprocwithcompile --preprocdependency="driverlib/wdta.draw" --objdirectory="driverlib" "../driverlib/wdta.c" Finished building: "../driverlib/wdta.c"

Building file: "../system/CCS/msp432startupccs.c" Invoking: ARM Compiler "C:/ti/ccsv8/tools/compiler/ti-cgt-arm18.12.0.LTS/bin/armcl" -mv7M4 --codestate=16 --floatsupport=FPv4SPD16 -me -O0 --optforspeed=2 --includepath="C:/ti/ccsv8/ccsbase/arm/include" --includepath="C:/ti/workspace/RTOSDemo/FullDemo" --includepath="C:/ti/workspace/RTOSDemo/driverlib/inc" --includepath="C:/ti/workspace/RTOSDemo/driverlib" --includepath="C:/FREERTOS/FreeRTOSv10.1.1/FreeRTOS-Plus/Source/FreeRTOS-Plus-CLI" --includepath="C:/FREERTOS/FreeRTOSv10.1.1/FreeRTOS/Demo/Common/include" --includepath="C:/FREERTOS/FreeRTOSv10.1.1/FreeRTOS/Source/include" --includepath="C:/FREERTOS/FreeRTOSv10.1.1/FreeRTOS/Source/portable/CCS/ARMCM4F" --includepath="C:/ti/ccsv8/tools/compiler/ti-cgt-arm18.12.0.LTS/include" --includepath="C:/ti/ccsv8/tools/compiler/ti-cgt-arm18.12.0.LTS/include/" --includepath="C:/ti/ccsv8/ccsbase/arm/include/" --includepath="C:/ti/ccsv8/ccsbase/arm/include/CMSIS" --includepath="C:/ti/workspace/RTOSDemo" --define=MSP432P401R --define=USECMSISREGISTERFORMAT=1 --define=TARGETISMSP432P4XX --define=ccs -g --gcc --diagwarning=225 --diagwrap=off --displayerrornumber --verbosediagnostics --genfuncsubsections=on --abi=eabi --preprocwithcompile --preprocdependency="system/CCS/msp432startupccs.draw" --objdirectory="system/CCS" "../system/CCS/msp432startupccs.c" Finished building: "../system/CCS/msp432startupccs.c"

Building file: "../system/CCS/printf-stdarg.c" Invoking: ARM Compiler "C:/ti/ccsv8/tools/compiler/ti-cgt-arm18.12.0.LTS/bin/armcl" -mv7M4 --codestate=16 --floatsupport=FPv4SPD16 -me -O0 --optforspeed=2 --includepath="C:/ti/ccsv8/ccsbase/arm/include" --includepath="C:/ti/workspace/RTOSDemo/FullDemo" --includepath="C:/ti/workspace/RTOSDemo/driverlib/inc" --includepath="C:/ti/workspace/RTOSDemo/driverlib" --includepath="C:/FREERTOS/FreeRTOSv10.1.1/FreeRTOS-Plus/Source/FreeRTOS-Plus-CLI" --includepath="C:/FREERTOS/FreeRTOSv10.1.1/FreeRTOS/Demo/Common/include" --includepath="C:/FREERTOS/FreeRTOSv10.1.1/FreeRTOS/Source/include" --includepath="C:/FREERTOS/FreeRTOSv10.1.1/FreeRTOS/Source/portable/CCS/ARMCM4F" --includepath="C:/ti/ccsv8/tools/compiler/ti-cgt-arm18.12.0.LTS/include" --includepath="C:/ti/ccsv8/tools/compiler/ti-cgt-arm18.12.0.LTS/include/" --includepath="C:/ti/ccsv8/ccsbase/arm/include/" --includepath="C:/ti/ccsv8/ccsbase/arm/include/CMSIS" --includepath="C:/ti/workspace/RTOSDemo" --define=MSP432P401R --define=USECMSISREGISTERFORMAT=1 --define=TARGETISMSP432P4XX --define=ccs -g --gcc --diagwarning=225 --diagwrap=off --displayerrornumber --verbosediagnostics --genfuncsubsections=on --abi=eabi --preprocwithcompile --preprocdependency="system/CCS/printf-stdarg.draw" --objdirectory="system/CCS" "../system/CCS/printf-stdarg.c" Finished building: "../system/CCS/printf-stdarg.c"

Building file: "../system/CCS/systemmsp432p401r.c" Invoking: ARM Compiler "C:/ti/ccsv8/tools/compiler/ti-cgt-arm18.12.0.LTS/bin/armcl" -mv7M4 --codestate=16 --floatsupport=FPv4SPD16 -me -O0 --optforspeed=2 --includepath="C:/ti/ccsv8/ccsbase/arm/include" --includepath="C:/ti/workspace/RTOSDemo/FullDemo" --includepath="C:/ti/workspace/RTOSDemo/driverlib/inc" --includepath="C:/ti/workspace/RTOSDemo/driverlib" --includepath="C:/FREERTOS/FreeRTOSv10.1.1/FreeRTOS-Plus/Source/FreeRTOS-Plus-CLI" --includepath="C:/FREERTOS/FreeRTOSv10.1.1/FreeRTOS/Demo/Common/include" --includepath="C:/FREERTOS/FreeRTOSv10.1.1/FreeRTOS/Source/include" --includepath="C:/FREERTOS/FreeRTOSv10.1.1/FreeRTOS/Source/portable/CCS/ARMCM4F" --includepath="C:/ti/ccsv8/tools/compiler/ti-cgt-arm18.12.0.LTS/include" --includepath="C:/ti/ccsv8/tools/compiler/ti-cgt-arm18.12.0.LTS/include/" --includepath="C:/ti/ccsv8/ccsbase/arm/include/" --includepath="C:/ti/ccsv8/ccsbase/arm/include/CMSIS" --includepath="C:/ti/workspace/RTOSDemo" --define=MSP432P401R --define=USECMSISREGISTERFORMAT=1 --define=TARGETISMSP432P4XX --define=ccs -g --gcc --diagwarning=225 --diagwrap=off --displayerrornumber --verbosediagnostics --genfuncsubsections=on --abi=eabi --preprocwithcompile --preprocdependency="system/CCS/systemmsp432p401r.draw" --objdirectory="system/CCS" "../system/CCS/systemmsp432p401r.c" Finished building: "../system/CCS/systemmsp432p401r.c"

gmake: Target 'all' not remade because of errors.

**** Build Finished **** ~~~


Build errors on CCS V8: FreeRTOS RTOSDemo (Cortex M4F MSP432 Launchpad) - 101 of them!

Posted by rtel on January 11, 2019

My reply is the same really, just looks like a compiler version mismatch - or just the wrong compiler.


Build errors on CCS V8: FreeRTOS RTOSDemo (Cortex M4F MSP432 Launchpad) - 101 of them!

Posted by n3rdx on January 11, 2019

Well, here is an interesting development - literally. I got the system to compile and run by "simply" moving the files RegTest.c and RegTest.s out of the CCS project workspace - to another folder - without any change in the code apparently. I can't believe it. I only did this by deleting the interim project build and copying from the FreeRTOS source tree using a fresh install - and then attempting to walk through the process of compilation. There are three files: RegTest.asm, RegTest.c, and RegTest.s, and RegTest.asm seemed to be the one that is needed. Well, at the moment I am running the 'full' demo on the target MSP432P401R processor :

Attachments

screenshot1.jpg (148443 bytes)

Build errors on CCS V8: FreeRTOS RTOSDemo (Cortex M4F MSP432 Launchpad) - 101 of them!

Posted by n3rdx on January 11, 2019

oh, the baud rate needs to be set to 19200 bps instead of the usual 115200 bps.


[ Back to the top ]    [ About FreeRTOS ]    [ Privacy ]    [ Sitemap ]    [ ]


Copyright (C) Amazon Web Services, Inc. or its affiliates. All rights reserved.

Latest News

FreeRTOS v10.2.0 is available for immediate download. MIT licensed, and including RISC-V and ARMv8-M (Cortex-M33) demos.

NXP tweet showing LPC5500 (ARMv8-M Cortex-M33) running FreeRTOS.

View a recording of the "OTA Update Security and Reliability" webinar, presented by TI and AWS.


Careers

FreeRTOS and other embedded software careers at AWS.



FreeRTOS Partners

ARM Connected RTOS partner for all ARM microcontroller cores

Cadence Tensilica Cortes

Espressif ESP32

IAR Partner

Microchip Premier RTOS Partner

RTOS partner of NXP for all NXP ARM microcontrollers

Mediatek

Renesas

RISC-V

SiFIve RISC-V

STMicro RTOS partner supporting ARM7, ARM Cortex-M3, ARM Cortex-M4 and ARM Cortex-M0

Texas Instruments MCU Developer Network RTOS partner for ARM and MSP430 microcontrollers

OpenRTOS and SafeRTOS

Xilinx Microblaze and Zynq partner